Charles Foster
type: Person
holds role: 2013 Chair
holds role: 2014 Chair
holds role: 2015 Chair
holds role: 2013 Programme Committee Member
holds role: 2014 Programme Committee Member
holds role: 2015 Programme Committee Member
holds role: 2016 Chair
holds role: 2016 Programme Committee Member
family_name: Foster
firstName: Charles
myersBriggs: ENTP
member of: XML Guild
Online Account: marklogic
Online Account: fostercharles
Online Account: cfoster
Skype ID: cfoster

Person
type: Class
label: person
comment: A person.
term status: stable
subclass of: Spatial Thing
subclass of: Agent
equivalentClass: Person
disjointWith: Organization
disjointWith: Project
scope note: Used to describe a Person related to a bibliographic ite such as an author, an editor, etc.

holds role
type: ObjectProperty
comment: Part of the role modelling machinery of SWC. This property relates a person to the role (e.g. a conference chair) it holds at an event.
term status: testing
domain: Person
range: Role
inverseOf: held by

2013 Chair
type: Chair
held by: Charles Foster
is role at: XML London 2013

2014 Chair
type: Chair
held by: Charles Foster
is role at: XML London 2014

2015 Chair
type: Chair
held by: Charles Foster
is role at: XML London 2015

family_name
type: DatatypeProperty
type: Property
comment: The family name of some person.
term status: archaic
domain: Person
range: Literal
scope note: This is the property we choose to use to describe the family name of a person related to a bibliographic resource.

firstName
type: DatatypeProperty
type: Property
comment: The first name of a person.
term status: testing
domain: Person
range: Literal

name
type: DatatypeProperty
type: Property
comment: A name for some thing.
term status: testing
domain: Thing
range: Literal
sub property of: label

myersBriggs
type: DatatypeProperty
type: Property
comment: A Myers Briggs (MBTI) personality classification.
term status: testing
domain: Person
range: Literal

homepage
type: ObjectProperty
type: Property
type: InverseFunctionalProperty
comment: A homepage for some thing.
term status: stable
domain: Thing
range: Document
sub property of: page
sub property of: is primary topic of
scope note: Used to link an agent to its homepage (which is a web page accessible using a URL).

Tatu Saloranta
type: Person
holds role: 2013 Presenter
family_name: Saloranta
firstName: Tatu
member of: FasterXML
Online Account: b2b
Online Account: cowtowncoder

Nick Van den Bleeken
type: Person
holds role: 2013 Presenter
family_name: Van den Bleeken
firstName: Nick
workplace homepage: http://www.inventivegroup.com/
weblog: http://blog.bleeken.eu/
Online Account: nvdbleek
Speaker At: Nick Van den Bleeken's 2013 talk

XML London 2014
type: Conference Event
has related document: 2014 Conference Proceedings
has role: 2014 Chair
has role: 2014 Programme Committee Member
has role: 2014 Presenter
has location: Roberts Engineering Building (UCL)
Online Account: about
Online Account: xmllondon
Sister Event: XML Prague 2014
Sister Event: XML Summer School 2014
Related Event: XML London 2013
Related Event: XML London 2015
Related Event: XML London 2016
Sponsored By: MarkLogic
Sponsored By: Saxonica
Sponsored By: oXygen
Sponsored By: Antenna House
Sponsored By: 3Ksoftware
Sponsored By: Xeditor

Conference Event
type: Class
comment: A scientific conference. TODO: Maybe this should be opened up - why only scientific conferences?
term status: testing
subclass of: Academic Event
subject: Academic Event

has related document
type: ObjectProperty
comment: Relates an event such as a conference, workshop, etc. to a document.
term status: testing
domain: Academic Event
range: Argumentative Document
inverseOf: related to Event

2014 Conference Proceedings
type: Proceedings
has part: Michael Kay's 2014 paper
has part: Abel Braaksma's 2014 paper
has part: Matt Kohl's 2014 paper
has part: William Narmontas's 2014 paper
has part: George Bina's 2014 paper
has part: Elias Weingärtner's 2014 paper
has part: Celina Huang's 2014 paper
has part: Steven Pemberton's 2014 paper
has part: Philip Fennell's 2014 paper
has part: Kal Ahmed's 2014 paper
has part: Robbert Broersma's 2014 paper
has part: Jorge Williams's 2014 paper
has part: Eduardo Gonçalves's 2014 paper
has part: Lech Rzedzicki's 2014 paper
has part: Eric van der Vlist's 2014 paper
related to Event: XML London 2014

has role
type: ObjectProperty
comment: Part of the role modelling machinery of SWC. This property relates an event (e.g. a conference) to a role at the event (e.g. a conference chair).
term status: testing
domain: Academic Event
range: Role
inverseOf: is role at

based near
type: ObjectProperty
type: Property
comment: A location that something is based near, for some broadly human notion of near.
term status: testing
domain: Spatial Thing
range: Spatial Thing
scope note: Used to link an agent, related to bibliographic things, to a place where it is based near: can be a city, a monument, a building, etc.

Chair
type: Class
comment: A sub-class of Role for various kinds of chair functions. Examples are the main chair of a conference, the tutorials chair, the proceedings chair, etc. Instead of introducing a large amount of sub-classes of Chair, we suggest to model all the different chair functions as instances of Chair with appropriate labels.
term status: testing
subclass of: Role
subject: Role

held by
type: ObjectProperty
comment: Part of the role modelling machinery of SWC. This property relates a role at an event (e.g. a conference chair) to the person who actually holds the role.
term status: testing
domain: Role
range: Person
inverseOf: holds role

is role at
type: ObjectProperty
comment: Part of the role modelling machinery of SWC. This property relates a role at an event (e.g. a conference chair) to the event (e.g. a conference).
term status: testing
domain: Role
range: Academic Event
inverseOf: has role

Proceedings
type: Class
comment: The proceedings of a conference or workshop, which contain the papers presented there.
term status: testing
subclass of: Document
subclass of: Artefact
subject: Document

Identifier
type: Property
modified: 2008-01-14
has version: identifier-006
comment: An unambiguous reference to the resource within a given context.
description: Recommended best practice is to identify the resource by means of a string conforming to a formal identification system.
issued: 1999-07-02
note: A second property with the same name as this property has been declared in the dcterms: namespace (http://purl.org/dc/terms/). See the Introduction to the document "DCMI Metadata Terms" (http://dublincore.org/documents/dcmi-terms/) for an explanation.

has part
type: ObjectProperty
comment: A generic property to model part-of relationships. In SWC this property is used to relate a proceedings document to the papers and articles contained in it.
term status: testing
domain: Thing
range: Thing

Michael Kay's 2014 paper
type: Paper
type: InProceedings
is part of: 2014 Conference Proceedings
creator: Michael Kay
creator: Debbie Lockett
title: Benchmarking XSLT Performance
page start: 10
page end: 23
month: June
year: 2014
related to Event: Michael Kay's 2014 talk

Abel Braaksma's 2014 paper
type: Paper
type: InProceedings
is part of: 2014 Conference Proceedings
creator: Abel Braaksma
title: Streaming Design Patterns or: How I Learned to Stop Worrying and Love the Stream
page start: 24
page end: 52
month: June
year: 2014
related to Event: Abel Braaksma's 2014 talk

Matt Kohl's 2014 paper
type: Paper
type: InProceedings
is part of: 2014 Conference Proceedings
creator: Matt Kohl
creator: Sandro Cirulli
creator: Phil Gooch
title: From monolithic XML for print/web to lean XML for data: realising linked data for dictionaries
page start: 53
page end: 62
month: June
year: 2014
related to Event: Matt Kohl's 2014 talk

William Narmontas's 2014 paper
type: Paper
type: InProceedings
is part of: 2014 Conference Proceedings
creator: Dino Fancellu
creator: William Narmontas
title: XML Processing in Scala
page start: 63
page end: 75
month: June
year: 2014
related to Event: William Narmontas's 2014 talk

George Bina's 2014 paper
type: Paper
type: InProceedings
is part of: 2014 Conference Proceedings
creator: George Bina
title: XML Authoring On Mobile Devices
page start: 76
page end: 82
month: June
year: 2014
related to Event: George Bina's 2014 talk

Elias Weingärtner's 2014 paper
type: Paper
type: InProceedings
is part of: 2014 Conference Proceedings
creator: Elias Weingärtner
creator: Christoph Ludwig
title: Engineering a XML-based Content Hub for Enterprise Publishing
page start: 83
page end: 87
month: June
year: 2014
related to Event: Elias Weingärtner's 2014 talk

Celina Huang's 2014 paper
type: Paper
type: InProceedings
is part of: 2014 Conference Proceedings
creator: Celina Huang
title: A Visual Comparison Approach to Automated Regression Testing
page start: 88
page end: 95
month: June
year: 2014
related to Event: Celina Huang's 2014 talk

Steven Pemberton's 2014 paper
type: Paper
type: InProceedings
is part of: 2014 Conference Proceedings
creator: Steven Pemberton
title: Live XML Data
page start: 96
page end: 102
month: June
year: 2014
related to Event: Steven Pemberton's 2014 talk

Philip Fennell's 2014 paper
type: Paper
type: InProceedings
is part of: 2014 Conference Proceedings
creator: Philip Fennell
title: Schematron - More useful than you’d thought
page start: 103
page end: 112
month: June
year: 2014
related to Event: Philip Fennell's 2014 talk

Kal Ahmed's 2014 paper
type: Paper
type: InProceedings
is part of: 2014 Conference Proceedings
creator: Kal Ahmed
title: Linked Data in a .NET World
page start: 113
page end: 127
month: June
year: 2014
related to Event: Kal Ahmed's 2014 talk

Robbert Broersma's 2014 paper
type: Paper
type: InProceedings
is part of: 2014 Conference Proceedings
creator: Robbert Broersma
creator: Yolijn van der Kolk
title: Frameless for XML - The Reactive Revolution
page start: 128
page end: 132
month: June
year: 2014
related to Event: Robbert Broersma's 2014 talk

Jorge Williams's 2014 paper
type: Paper
type: InProceedings
is part of: 2014 Conference Proceedings
creator: Jorge Williams
title: Product Usage Schemas
page start: 133
page end: 147
month: June
year: 2014
related to Event: Jorge Williams's 2014 talk

Eduardo Gonçalves's 2014 paper
type: Paper
type: InProceedings
is part of: 2014 Conference Proceedings
creator: Eduardo Corrêa Gonçalves
creator: Vanessa Braganholo
title: An XML-based Approach for Data Preprocessing of Multi-Label Classification Problems
page start: 148
page end: 151
month: June
year: 2014
related to Event: Eduardo Gonçalves's 2014 talk

Lech Rzedzicki's 2014 paper
type: Paper
type: InProceedings
is part of: 2014 Conference Proceedings
creator: Lech Rzedzicki
title: Using Abstract Content Model and Wikis to link Semantic Web, XML, HTML, JSON and CSV
page start: 152
page end: 156
month: June
year: 2014
related to Event: Lech Rzedzicki's 2014 talk

Eric van der Vlist's 2014 paper
type: Paper
type: InProceedings
is part of: 2014 Conference Proceedings
creator: Eric Van Der Vlist
title: JSON and XML: a new perspective
page start: 157
page end: 161
month: June
year: 2014
related to Event: Eric van der Vlist's 2014 talk

Paper
type: Class
comment: A scientific/scholarly paper, e.g., an article in a scientific journal, or a paper at a conference or workshop. A paper could also be unpublished formally, as long as it has the form of a scientific paper (introduction, conclusion, related work, etc.).
term status: testing
subclass of: Argumentative Document
subclass of: Artefact
subject: Document

is part of
type: ObjectProperty
comment: A generic property to model part-of relationships. In SWC this property is used to relate papers or articles to the proceedings document in which they are contained.
term status: testing
domain: Thing
range: Thing

Creator
type: AnnotationProperty
type: Property
modified: 2008-01-14
has version: creator-006
comment: An entity primarily responsible for making the resource.
description: Examples of a Creator include a person, an organization, or a service. Typically, the name of a Creator should be used to indicate the entity.
issued: 1999-07-02
note: A second property with the same name as this property has been declared in the dcterms: namespace (http://purl.org/dc/terms/). See the Introduction to the document "DCMI Metadata Terms" (http://dublincore.org/documents/dcmi-terms/) for an explanation.

Michael Kay
type: Person
holds role: 2014 Presenter
holds role: 2016 Presenter
family_name: Kay
firstName: Michael
workplace homepage: http://www.saxonica.com
homepage: http://en.wikipedia.org/wiki/Michael_Howard_Kay
about: Michael Howard Kay
member of: Saxonica
member of: XML Guild
Online Account: a1a
Online Account: michaelhkay
Speaker At: Michael Kay's 2014 talk

Debbie Lockett
type: Person
holds role: 2014 Presenter
family_name: Lockett
firstName: Debbie
workplace homepage: http://www.saxonica.com/
member of: Saxonica
Online Account: debbie lockett
Online Account: deblock

Subject
type: Property
modified: 2012-06-14
has version: subject-007
comment: The topic of the resource.
description: Typically, the subject will be represented using keywords, key phrases, or classification codes. Recommended best practice is to use a controlled vocabulary.
issued: 1999-07-02
note: A second property with the same name as this property has been declared in the dcterms: namespace (http://purl.org/dc/terms/). See the Introduction to the document "DCMI Metadata Terms" (http://dublincore.org/documents/dcmi-terms/) for an explanation.

Title
type: AnnotationProperty
type: Property
modified: 2008-01-14
has version: title-006
comment: A name given to the resource.
issued: 1999-07-02
note: A second property with the same name as this property has been declared in the dcterms: namespace (http://purl.org/dc/terms/). See the Introduction to the document "DCMI Metadata Terms" (http://dublincore.org/documents/dcmi-terms/) for an explanation.

list of authors
type: ObjectProperty
comment: An ordered list of authors. Normally, this list is seen as a priority list that order authors by importance.
term status: stable
domain: Document
range: Class
  unionOf: List
  unionOf: Seq
range: Class
  unionOf: List
  unionOf: Seq
sub property of: list of contributors

page start
type: DatatypeProperty
comment: Starting page number within a continuous page range.
term status: stable
domain: Document
range: Literal
sub property of: locator

page end
type: DatatypeProperty
comment: Ending page number within a continuous page range.
term status: stable
domain: Document
range: Literal
sub property of: locator

maker
type: ObjectProperty
type: Property
comment: An agent that made this thing.
term status: stable
domain: Thing
range: Agent
inverseOf: made
equivalentProperty: creator

Semantic Web Conference Ontology
type: Ontology
maker: Knud Möller
maker: Sean Bechhofer
maker: Tom Heath
created: 2007/05/31
modified: $Date: 2009-05-11 17:50:14 +0100 (Mon, 11 May 2009) $
creator: Knud Möller
creator: Sean Bechhofer
creator: Tom Heath
earlier version: swc 2009-03-02.rdf
has version: swc 2009-03-02.rdf
has version: swc 2009-02-27.rdf
author list:
  item: Knud Möller
  item: Sean Bechhofer
  item: Tom Heath
author list:
  item: Knud Möller
  item: Sean Bechhofer
  item: Tom Heath
license: http://creativecommons.org/licenses/by/3.0/
license doc: License Statement
userdocs: Introduction
userdocs: Describing Papers
userdocs: Roles
revision: $Revision: 895 $ - Slim Version
imports: swrc
imports: swrc-topics

Ontology
type: Class
comment: The class of ontologies.
subclass of: Resource

created
type: DatatypeProperty
sub property of: date
scope note: Used to describe the creation date of a bibliographic item

title
type: ObjectProperty
type: AnnotationProperty
scope note: Used to describe the title of a bibliographic resource

Knud Möller
type: Person
Surname: Möller

Sean Bechhofer
type: Person
Surname: Bechhofer

Tom Heath
type: Person
Surname: Heath

logo
type: ObjectProperty
type: Property
type: InverseFunctionalProperty
comment: A logo representing some thing.
term status: testing
domain: Thing
range: Thing

License Statement
comment: Copyright © 2007-2009 Knud Möller, Sean Bechhofer and Tom Heath. This work is licensed under a Creative Commons Attribution License. This copyright applies to the Semantic Web Conference Ontology (SWC) Specification and accompanying documentation in RDF. Regarding underlying technology, SWC uses W3C's RDF technology, an open Web standard that can be freely used by anyone.

Introduction
comment: The Semantic Web Conference ontology (SWC) is an ontology for describing academic conferences. It was initially designed to support the European Semantic Web Conference, ESWC2007, and later extended for both the following conferences in the ESWC series, as well as in the ISWC series. Historically, the SWC ontology also draws heavily on ontologies developed for ESWC2006 and ISWC2006. SWC is mainly a convention of how to use classes and properties from other ontologies, most prominently FOAF (for people) and SWRC (their BibTeX elements, for the papers). We are also throwing in some SIOC, Dublin Core and iCal/RDF Calendar. Our own swc namespace provides the glue for all this, as well as specialised classes for things that have to do with conferences. This version of SWC has been slimmed down significantly (hence the revision name). A total of 59 classes and 19 properties have been deprecated (deprecated terms can be found at the bottom of this document). This was mostly done with the intention to remove the countless sub-classes of generic classes such as Chair or SessionEvent, which were deemed to be too specific for a general-purpose conference ontology such as SWC. Elsewhere, classes and properties which had never been used and seemed to fall under the heading of "over-engineering" were removed. Finally, all CfP related terms were removed. Instead, we suggest to use a dedicated ontology such as the CfP ontology.

Describing Papers
comment: For the basic use case of describing papers, the figure below shows how the main kinds of resources are connected: the paper itself, the authors and their affiliations, and the talk where the paper was presented. The next figure shows in more detail the kinds of things that can be said about each of the four main entities surrounding a paper.

Roles
comment: One of the basic design choices in SWC is to use role modelling for describing the different functions at a conference, such as chairs, reviewers, etc. For any particular role at a given conference, the swc:Role class or a sub-class will be instantiated. This role instance stands in relation to a person (who plays the role) and an event. The figure below gives an example showing how to model the role of the metadata chair (or "dog food tsar") at ISWC+ASWC2007, which was held by Knud Möller (together with Tom Heath, not shown in the figure). Note that the metadata chair role is not modelled with its own dedicated class (although it could have been). Instead, an instance of the generic Chair class is used and labelled accordingly.

imports
type: OntologyProperty
comment: The property that is used for importing other ontologies into a given ontology.
domain: Ontology
range: Ontology

Surname
type: DatatypeProperty
type: Property
comment: The surname of some person.
term status: archaic
domain: Person
range: Literal

DERI
type: Organization
member: Knud Möller

Organization
type: Class
comment: An organization.
term status: stable
subclass of: Agent
disjointWith: Person
disjointWith: Document
scope note: Ued to describe an organization related to bibliographic items such as a publishing company, etc.

member
type: ObjectProperty
type: Property
comment: Indicates a member of a Group
term status: stable
domain: Group
range: Agent

Talis Information Limited
type: Organization
member: Tom Heath

University of Manchester
type: Organization
member: Sean Bechhofer

Argumentative Document
type: Class
comment: An argumentative document is a document which uses analytical reasoning and evidence in order to argue for a point of view. Typical examples are scientific papers or political pamphlets. Negative examples are novels or plays (even though a novel might also try to sway the reader to a certain point of view). According to Text Types, an argumentative document is based "on the evaluation and the subsequent subjective judgement in answer to a problem. It refers to the reasons advanced for or against a matter".
term status: testing
subclass of: Document
subject: Document

Class
comment: The class of OWL classes.
subclass of: Class

Document
type: Class
comment: A document.
term status: stable
equivalentClass: CreativeWork
disjointWith: Organization
disjointWith: Project

subject
type: ObjectProperty
scope note: Used to describe the subject of a bibliographic resource.

Artefact
type: Class
comment: Artefact here means a document which can have a physical manifestation, like a paper or the proceedings of a conference.
term status: testing
subclass of: Document
subject: Document

Poster
type: Class
comment: A scientific poster at a conference or workshop.
term status: testing
subclass of: Argumentative Document
subclass of: Artefact
subject: Document

Slide Set
type: Class
comment: A set of slides used for a presentation of e.g. a paper at a conference.
term status: testing
subclass of: Argumentative Document
subclass of: Artefact
subject: Document

Programme
type: Class
comment: A document containing the programme of an event such as a conference or workshop. Typically, the programme would list the times and dates for the individual sub-events, e.g., talks, dinners, panel discussions, etc.
term status: testing
subclass of: Document
subclass of: Artefact
subject: Document

Organised Event
type: Class
comment: An event in time and space which is planned and organised, as opposed to something which 'just happens', such as a car accident or sunset.
term status: testing
subclass of: Event-1
subclass of: Vevent
subject: Event, other

Academic Event
type: Class
comment: Academic events are e.g. conferences and conference-like events, and all the sub-events of those which are about the topic or theme of the conference, such as talks or panels.
term status: testing
subclass of: Organised Event

Panel Event
type: Class
comment: A panel discussion at a conference or conference-like event, usually involving several speakers.
term status: testing
subclass of: Academic Event
subject: Academic Event

Workshop Event
type: Class
comment: A scientific workshop. Workshops are often co-located with ConferenceEvents.
term status: testing
subclass of: Academic Event
subject: Academic Event

Tutorial Event
type: Class
comment: A tutorial is a special session at a conference or workshop, somewhat like a long lecture on a specific topic.
term status: testing
subclass of: Academic Event
subject: Academic Event

Track Event
type: Class
comment: A track groups all those sessions or events at a conference or workshop that belong to a common, overall theme. Depending on the conference, tracks can be quite generic, such as "Research" or "Industrial", but can also be more specific, such as "Semantic Web" or "Numismatics". SWC does not define any specific tracks, since conferences often differ so much with respect to how they structure their tracks, that it would be pointless to try and find a set of tracks that would suit all conferences. Sub-classes of TrackEvent which were defined in previous versions of the SWC ontology are now deprecated.
term status: testing
subclass of: Academic Event
subject: Academic Event

Session Event
type: Class
comment: A session dedicated to a specific topic at a conference. This could be a session with talks, or also a poster session, a demo session, or any other kind of session.
term status: testing
subclass of: Academic Event
subject: Academic Event

Talk Event
type: Class
comment: A speaker giving a talk. This could be the presentation of a paper, but also keynote speech or any other kind of talk.
term status: testing
subclass of: Academic Event
subject: Academic Event

Non-academic Event
type: Class
comment: In the context of SWC, a non-academic event is any kind or organised event which does not concern the topic or theme of the conference as such. Examples are breaks, dinners, parties, etc.
term status: testing
subclass of: Organised Event
subject: Event, other

Break Event
type: Class
comment: Any kind of break at the super-event, such as a coffee break.
term status: testing
subclass of: Non-academic Event
subject: Event, other

Social Event
type: Class
comment: Examples for social events are parties or excursions.
term status: testing
subclass of: Non-academic Event
subject: Event, other

Meal Event
type: Class
comment: A lunch, dinner or similar event at a conference or conference-like event.
term status: testing
subclass of: Non-academic Event
subject: Event, other

Conference Venue Place
type: Class
comment: The location of a conference or conference-like event. Ideally, this would be more specific than just the city. Instead it should be the hotel, convention centre, university or similar place where the event is held.
term status: testing
subclass of: Spatial Thing
subject: Place

Spatial Thing
type: Class
label: SpatialThing
comment: Anything with spatial extent, i.e. size, shape, or position. e.g. people, places, bowling balls, as well as abstract areas like cubes.

Meeting Room Place
type: Class
comment: A particular room at the conference venue (or elsewhere). E.g., the room where a particular SessionEvent takes place.
term status: testing
subclass of: Spatial Thing
subject: Place

Communal Place
type: Class
comment: A location at the conference venue (or elsewhere), which is not a meeting room.
term status: testing
subclass of: Spatial Thing
subject: Place

Accommodation Place
type: Class
comment: A hotel, hostel, BnB or similar.
term status: testing
subclass of: Spatial Thing
subject: Place

Role
type: Class
comment: Role is the super-class of all the different roles performed at a conference or workshop. Examples are the various conference chairs, the delegates, presenters, PC members, etc. The intended use of this class is that an instance of Role will be related to the event at which it is performed, and to the person which performs it. Since the set of roles is slightly different for each event, and since it would therefore be impossible to provide sub-classes for all needs and circumstances, the SWC ontology only contains a very basic set of Role classes. Rather than diversifying the set of Role classes to cater for all needs, users should instead instantiate the small set of different Role classes and cover the roles at a specific event in this way. E.g., instead of sub-classing the Chair role with MainChair, WorkshopChair, TutorialChair, etc., the different kinds of chairs should simply be instances of the generic Chair class and be labelled appropriately.
term status: testing
subclass of: Role-1
subject: Role

Delegate
type: Class
comment: A delegate is someone who attends a conference or conference-like event.
term status: testing
subclass of: Role
subject: Role

Presenter
type: Class
comment: A presenter is someone who presents matter in front of an audience. Examples of events to which this role applies are paper presentations, tutorials, or talks. A keynote speaker could also be modelled as an instance of this class.
term status: testing
subclass of: Role
subject: Role

Programme Committee Member
type: Class
comment: This role is played by the members of the programme committee of a conference or conference-like event. We found this role to be so significant that it justifies to be represented by its own class.
term status: testing
subclass of: Role
subject: Role

related to Event
type: ObjectProperty
comment: Relates a document to an event such as a conference, workshop, etc.
term status: testing
domain: Argumentative Document
range: Academic Event
inverseOf: has related document

ObjectProperty
type: Class
comment: The class of object properties.
subclass of: Property

inverseOf
type: Property
comment: The property that determines that two given properties are inverse.
domain: ObjectProperty
range: ObjectProperty

is sub-event of
type: TransitiveProperty
comment: Events can be sub-events of other events. E.g., a talk can be a sub-event of a session, which in turn can be a sub-event of a conference. The relation is transitive - the talk is also a sub-event of the conference.
term status: testing
domain: Vevent
range: Vevent
inverseOf: is the super-event of

TransitiveProperty
type: Class
comment: The class of transitive properties.
subclass of: ObjectProperty

is the super-event of
type: TransitiveProperty
label: is super-event of
comment: Events can be super-events of other events. E.g., a conference can be the super-event of a session, which in turn can be the super-event of a talk. The relation is transitive - the conference is also the super-event of the talk.
term status: testing
domain: Vevent
range: Vevent
inverseOf: is sub-event of

member of
type: ObjectProperty
comment: FOAF does not define an inverse of foaf:member, so SWC does it.
term status: testing
domain: Person
range: Group
inverseOf: member

Group
type: Class
comment: A class of Agents.
term status: stable
subclass of: Agent

has location
type: ObjectProperty
comment: Relates an event such as a conference or any sub-event thereof to a location where it takes place.
term status: testing
domain: Organised Event
range: Spatial Thing

has programme
type: ObjectProperty
comment: Relates an event such as a conference to its Programme.
term status: testing
domain: Organised Event
range: Programme

plans to attend
type: ObjectProperty
comment: A person might plan to attend a talk or session at a conference or similar event. This property could be used to prepare a delegate's conference experience with respect to who they want to meet, etc.
term status: testing
domain: Person
range: Organised Event

has related artefact
type: ObjectProperty
comment: Relates an event such as a conference, workshop, etc. to a physical artefact.
term status: testing
domain: Academic Event
range: Artefact

is location of
type: ObjectProperty
comment: Relates a location to a conference or sub-event thereof which takes place at it.
term status: testing
domain: Spatial Thing
range: Organised Event

Thing
type: Class
comment: The class of OWL individuals.

Project
type: Class
comment: A project (a collective endeavour of some kind).
term status: testing
disjointWith: Person
disjointWith: Document

title
type: DatatypeProperty
type: Property
comment: Title (Mr, Mrs, Ms, Dr. etc)
term status: testing

DatatypeProperty
type: Class
comment: The class of data properties.
subclass of: Property

sha1sum of a personal mailbox URI name
type: DatatypeProperty
type: Property
type: InverseFunctionalProperty
comment: The sha1sum of the URI of an Internet mailbox associated with exactly one owner, the first owner of the mailbox.
term status: testing
domain: Agent
range: Literal

personal mailbox
type: ObjectProperty
type: DatatypeProperty
type: Property
type: InverseFunctionalProperty
comment: A personal mailbox, ie. an Internet mailbox associated with exactly one owner, the first owner of this mailbox. This is a 'static inverse functional property', in that there is (across time and change) at most one individual that ever has any particular value for foaf:mbox.
term status: stable
domain: Agent
range: Thing

Contributor
type: AnnotationProperty
type: Property
modified: 2008-01-14
has version: contributor-006
comment: An entity responsible for making contributions to the resource.
description: Examples of a Contributor include a person, an organization, or a service. Typically, the name of a Contributor should be used to indicate the entity.
issued: 1999-07-02
note: A second property with the same name as this property has been declared in the dcterms: namespace (http://purl.org/dc/terms/). See the Introduction to the document "DCMI Metadata Terms" (http://dublincore.org/documents/dcmi-terms/) for an explanation.

AnnotationProperty
type: Class
comment: The class of annotation properties.
subclass of: Property

Date
type: AnnotationProperty
type: Property
modified: 2008-01-14
has version: date-006
comment: A point or period of time associated with an event in the lifecycle of the resource.
description: Date may be used to express temporal information at any level of granularity. Recommended best practice is to use an encoding scheme, such as the W3CDTF profile of ISO 8601 [W3CDTF].
issued: 1999-07-02
note: A second property with the same name as this property has been declared in the dcterms: namespace (http://purl.org/dc/terms/). See the Introduction to the document "DCMI Metadata Terms" (http://dublincore.org/documents/dcmi-terms/) for an explanation.

Description
type: AnnotationProperty
type: Property
modified: 2008-01-14
has version: description-006
comment: An account of the resource.
description: Description may include but is not limited to: an abstract, a table of contents, a graphical representation, or a free-text account of the resource.
issued: 1999-07-02
note: A second property with the same name as this property has been declared in the dcterms: namespace (http://purl.org/dc/terms/). See the Introduction to the document "DCMI Metadata Terms" (http://dublincore.org/documents/dcmi-terms/) for an explanation.

Conference Chair
type: DeprecatedClass
term status: deprecated
subclass of: Role
subject: Chairman

DeprecatedClass
type: Class
comment: The class of deprecated classes.
subclass of: Class

Track Chair
type: DeprecatedClass
comment: The chair of a particular track of a conference, responsible for all submissions and actions regarding this track.
term status: deprecated
subclass of: Role
subject: Chairman

Programme Chair
type: DeprecatedClass
term status: deprecated
subclass of: Role
subject: Chairman

Workshops Chair
type: DeprecatedClass
term status: deprecated
subclass of: Role
subject: Chairman

Tutorials Chair
type: DeprecatedClass
term status: deprecated
subclass of: Role
subject: Chairman

Posters Chair
type: DeprecatedClass
comment: Deprecating this, just use TrackChair instead.
term status: deprecated
subclass of: Role
subject: Chairman

Demos Chair
type: DeprecatedClass
comment: Deprecating this, just use TrackChair instead.
term status: deprecated
subclass of: Role
subject: Chairman

Industry Chair or In-Use Chair
type: DeprecatedClass
comment: Deprecating this, just use TrackChair instead.
term status: deprecated
subclass of: Role
subject: Chairman

Sponsorship Chair
type: DeprecatedClass
term status: deprecated
subclass of: Role
subject: Chairman

Publicity Chair
type: DeprecatedClass
term status: deprecated
subclass of: Role
subject: Chairman

PhD Symposium or Doctoral Consortium Chair
type: DeprecatedClass
comment: Deprecating this, just use TrackChair instead.
term status: deprecated
subclass of: Role
subject: Chairman

Semantic Web Challenge Chair
type: DeprecatedClass
comment: Deprecating this, just use TrackChair instead.
term status: deprecated
subclass of: Role
subject: Chairman

Treasurer
type: DeprecatedClass
term status: deprecated
subclass of: Role
subject: Role

Submissions Chair
type: DeprecatedClass
term status: deprecated
subclass of: Role
subject: Chairman

(Printed) Proceedings Chair
type: DeprecatedClass
term status: deprecated
subclass of: Role
subject: Chairman

Exhibition Chair
type: DeprecatedClass
comment: Deprecating this, just use TrackChair instead.
term status: deprecated
subclass of: Role
subject: Chairman

Local Organiser
type: DeprecatedClass
term status: deprecated
subclass of: Role
subject: Role

Administrator
type: DeprecatedClass
term status: deprecated
subclass of: Role
subject: Role

Webmaster
type: DeprecatedClass
term status: deprecated
subclass of: Role
subject: Role

Dogfood Tsar
type: DeprecatedClass
comment: A role that is only relevant in relation to the topic of the conference e.g. Semantic Web Technologies Coordinator at a Semantic Web Conference.
term status: deprecated
subclass of: Role
subject: Chairman

Organising Committee Member
type: DeprecatedClass
term status: deprecated
subclass of: Role
subject: Role

Workshop Organiser
type: DeprecatedClass
term status: deprecated
subclass of: Role
subject: Role

Tutorial Presenter
type: DeprecatedClass
comment: Deprecating this, just use Presenter instead.
term status: deprecated
subclass of: Role
subject: Role

Session Chair
type: DeprecatedClass
term status: deprecated
subclass of: Role
subject: Chairman

Tutor
type: DeprecatedClass
term status: deprecated
subclass of: Role
subject: Role

Reviewer
type: DeprecatedClass
comment: Deprecating this, just use ProgrammeCommitteeMember instead.
term status: deprecated
subclass of: Role
subject: Role

Additional Reviewer
type: DeprecatedClass
term status: deprecated
subclass of: Role
subject: Role

System Description
type: DeprecatedClass
comment: A type of paper which is mainly describes the properties, implementation or architecture of an system (such as a software system). Deprecating this: it's too specific for, not generic enough to apply for most conferences.
term status: deprecated
subclass of: Paper
subject: Document

Industrial Talk
type: DeprecatedClass
comment: Deprecating this - we can just as well use TalkEvent.
term status: deprecated
subclass of: Talk Event
subject: Academic Event

Industrial Track
type: DeprecatedClass
comment: Deprecating this - we can just as well use TrackEvent.
term status: deprecated
subclass of: Track Event
subject: Academic Event

Research Track
type: DeprecatedClass
comment: Deprecating this - we can just as well use TrackEvent.
term status: deprecated
subclass of: Track Event
subject: Academic Event

Paper Session
type: DeprecatedClass
comment: Deprecating this - we can just as well use SessionEvent.
term status: deprecated
subclass of: Session Event
subject: Academic Event

Poster Session
type: DeprecatedClass
comment: Deprecating this - we can just as well use SessionEvent.
term status: deprecated
subclass of: Session Event
subject: Academic Event

Demo Session
type: DeprecatedClass
comment: Deprecating this - we can just as well use SessionEvent.
term status: deprecated
subclass of: Session Event
subject: Academic Event

Welcome Talk
type: DeprecatedClass
comment: Deprecating this - we can just as well use TalkEvent.
term status: deprecated
subclass of: Talk Event
subject: Academic Event

Keynote Talk
type: DeprecatedClass
comment: Deprecating this - we can just as well use TalkEvent.
term status: deprecated
subclass of: Talk Event
subject: Academic Event

Paper Presentation
type: DeprecatedClass
comment: Deprecating this - we can just as well use TalkEvent.
term status: deprecated
subclass of: Talk Event
subject: Academic Event

Poster Presentation
type: DeprecatedClass
comment: Deprecating this - we can just as well use TalkEvent.
term status: deprecated
subclass of: Talk Event
subject: Academic Event

Demo Presentation
type: DeprecatedClass
comment: Deprecating this - we can just as well use TalkEvent.
term status: deprecated
subclass of: Talk Event
subject: Academic Event

Opening Event
type: DeprecatedClass
comment: Deprecating this - we can just use TalkEvent.
term status: deprecated
subclass of: Non-academic Event
subject: Event, other

Closing Event
type: DeprecatedClass
comment: Deprecating this - we can just use TalkEvent.
term status: deprecated
subclass of: Non-academic Event
subject: Event, other

Coffee Break
type: DeprecatedClass
comment: Deprecating this - we can just use BreakEvent.
term status: deprecated
subclass of: Break Event
subject: Event, other

Meal Break
type: DeprecatedClass
comment: Deprecating this - we can just use BreakEvent.
term status: deprecated
subclass of: Break Event
subject: Event, other

Free Time Break
type: DeprecatedClass
comment: Deprecating this - we can just use BreakEvent.
term status: deprecated
subclass of: Break Event
subject: Event, other

Excursion
type: DeprecatedClass
comment: Deprecating this - we can just use SocialEvent.
term status: deprecated
subclass of: Social Event
subject: Event, other

Reception
type: DeprecatedClass
comment: Deprecating this - we can just use SocialEvent.
term status: deprecated
subclass of: Social Event
subject: Event, other

Conference Dinner
type: DeprecatedClass
comment: Deprecating this - we can just use SocialEvent.
term status: deprecated
subclass of: Social Event
subclass of: Meal Event
subject: Event, other

Invited Paper
type: DeprecatedClass
comment: As opposed to a peer-reviewed paper. This class has been deprecated in order to reduce the inflation of classes.
term status: deprecated
subclass of: InProceedings
subject: Document

System Demonstration
type: DeprecatedClass
comment: A type of paper which accompanies the demonstration of software, also known as an extended abstract or demo description. This class has been deprecated in order to reduce the inflation of classes; it is too specific for CS conferences.
term status: deprecated
subclass of: Paper
subject: Document

Call
type: DeprecatedClass
comment: The call classes have been deprecated in SWC. Instead, we suggest to use the CfP ontology. A call is a public announcement, asking for contribution of some kind to events such as conferences or workshops, or to a publication such as a journal or book.
term status: deprecated
subclass of: Announcement
subject: Call

Call for Participation
type: DeprecatedClass
comment: This kind of call usually calls for potential delegates to attend an event such as a conference or a workshop.
term status: deprecated
subclass of: Call
subject: Call

Call for Proposals
type: DeprecatedClass
comment: A call which asks for contributions in the form of e.g. workshop or tutorial proposals.
term status: deprecated
subclass of: Call
subject: Call

Call for Papers
type: DeprecatedClass
comment: A call for papers or CfP encourages authors to submit papers for peer-review for a conference or workshop, or a journal or book.
term status: deprecated
subclass of: Call
subject: Call

Call for Posters
type: DeprecatedClass
comment: A call for scientific posters at a conference or workshop. Submissions are usually in the form of extended abstracts (~2 page) discussing the research presented on the poster.
term status: deprecated
subclass of: Call
subject: Call

Call for Demos
type: DeprecatedClass
comment: A call for demonstrations of software at a conference or workshop. Submissions are usually in the form of extended abstracts (~2 page) discussing the research questions addressed by the software and outlining the content of the demonstration.
term status: deprecated
subclass of: Call
subject: Call

Sponsorship
type: DeprecatedClass
comment: Deprecated because it has never been used and in order to reduce the inflation of ontology terms.
term status: deprecated
subclass of: Sponsorship

is provider of
type: DeprecatedProperty
comment: Deprecated because it has never been used and in order to reduce the inflation of ontology terms.
term status: deprecated
domain: Organisation
range: Sponsorship
inverseOf: is provided by

DeprecatedProperty
type: Class
comment: The class of deprecated properties.
subclass of: Property

is provided by
type: DeprecatedProperty
comment: Deprecated because it has never been used and in order to reduce the inflation of ontology terms.
term status: deprecated
domain: Sponsorship
range: Organisation
inverseOf: is provider of

has cost amount
type: DeprecatedProperty
comment: Deprecated because it has never been used and in order to reduce the inflation of ontology terms.
term status: deprecated
domain: Sponsorship
range: integer

has cost currency
type: DeprecatedProperty
comment: Deprecated because it has never been used and in order to reduce the inflation of ontology terms.
term status: deprecated
domain: Sponsorship
range: string

has menu
type: DeprecatedProperty
comment: Deprecated because it has never been used and in order to reduce the inflation of ontology terms.
term status: deprecated
domain: Meal Event
range: Menu

bibliographic reference
type: DeprecatedProperty
comment: Deprecated because it has never been used and in order to reduce the inflation of ontology terms.
term status: deprecated
domain: Artefact
range: string

has sponsorship
type: DeprecatedProperty
comment: Deprecated because it has never been used and in order to reduce the inflation of ontology terms.
term status: deprecated
domain: Organised Event
range: Sponsorship

for event
type: DeprecatedProperty
comment: The call classes have been deprecated in SWC. Instead, we suggest to use the CfP ontology.
term status: deprecated
domain: Call
range: Academic Event
inverseOf: has call

has call
type: DeprecatedProperty
comment: The call classes have been deprecated in SWC. Instead, we suggest to use the CfP ontology.
term status: deprecated
domain: Academic Event
range: Call
inverseOf: for event

has submission deadline
type: DeprecatedProperty
comment: The call classes have been deprecated in SWC. Instead, we suggest to use the CfP ontology.
term status: deprecated
domain: Call
range: dateTime

has submission instructions
type: DeprecatedProperty
comment: The call classes have been deprecated in SWC. Instead, we suggest to use the CfP ontology.
term status: deprecated
domain: Call
range: string

has notification deadline
type: DeprecatedProperty
comment: The call classes have been deprecated in SWC. Instead, we suggest to use the CfP ontology.
term status: deprecated
domain: Call
range: dateTime

has camera-ready deadline
type: DeprecatedProperty
comment: The call classes have been deprecated in SWC. Instead, we suggest to use the CfP ontology.
term status: deprecated
domain: Call
range: dateTime

has attendee
type: DeprecatedProperty
comment: Instead of this property, use the Delegate role.
term status: deprecated
domain: Organised Event
range: Person
inverseOf: attendee at

attendee at
type: DeprecatedProperty
comment: Instead of this property, use the Delegate role.
term status: deprecated
domain: Person
range: Organised Event
inverseOf: has attendee

is topic of
type: DeprecatedProperty
comment: Deprecated, instead using terms from FOAF.
term status: deprecated
domain: ResearchTopic

has topic
type: DeprecatedProperty
comment: Instead of this property, use foaf:topic.
term status: deprecated
range: ResearchTopic

uuid
type: DeprecatedProperty
term status: deprecated

Drinking Place
type: DeprecatedClass
comment: Deprecated to reduce inflation of terms.
term status: deprecated
subclass of: Place
subject: Place

Place
type: DeprecatedClass
comment: Deprecated: no real need to have an internal super-class for locations, we can just use the SpatialThing.
term status: deprecated
subclass of: Spatial Thing
subject: Place

Eating Place
type: DeprecatedClass
comment: Deprecated to reduce inflation of terms.
term status: deprecated
subclass of: Place
subject: Place

affiliation
type: DeprecatedProperty
term status: deprecated

Eric Van Der Vlist
type: Person
holds role: 2013 Programme Committee Member
holds role: 2014 Programme Committee Member
holds role: 2015 Programme Committee Member
holds role: 2013 Presenter
holds role: 2014 Presenter
holds role: 2015 Presenter
holds role: 2016 Programme Committee Member
family_name: Van Der Vlist
firstName: Eric
member of: XML Guild
Online Account: evlist
Speaker At: Eric Van der Vlist's 2013 talk
Speaker At: Eric van der Vlist's 2014 talk
Speaker At: Eric van der Vlist's 2015 talk

O'Neil Delpratt
type: Person
holds role: 2013 Presenter
family_name: Delpratt
firstName: O'Neil
workplace homepage: http://www.saxonica.com/
member of: Saxonica
Online Account: ond1
Online Account: http://uk.linkedin.com/pub/o-neil-delpratt/2b/3ba/348
Speaker At: O'Neil Delpratt's 2013 talk

workplace homepage
type: ObjectProperty
type: Property
comment: A workplace homepage of some person; the homepage of an organization they work for.
term status: testing
domain: Person
range: Document

Tomos Hillman
type: Person
holds role: 2013 Presenter
family_name: Hillman
firstName: Tomos
member of: Oxford University Press
Online Account: tom yamahito
Online Account: http://uk.linkedin.com/pub/tomos-hillman/12/636/7
Speaker At: Tomos Hillman's 2013 talk

Richard Pineger
type: Person
holds role: 2013 Presenter
family_name: Pineger
firstName: Richard
member of: Oxford University Press

Nigel Whitaker
type: Person
holds role: 2013 Presenter
holds role: 2016 Presenter
family_name: Whitaker
firstName: Nigel
workplace homepage: http://www.deltaxml.com/
weblog: http://blogs.deltaxml.com/author/nigelwhitaker/
member of: DeltaXML
Online Account: 7b1
Speaker At: Nigel Whitaker's 2013 talk
Speaker At: Nigel Whitaker's 2016 talk

weblog
type: ObjectProperty
type: Property
type: InverseFunctionalProperty
comment: A weblog of some thing (whether person, group, company etc.).
term status: stable
domain: Agent
range: Document
sub property of: page

Robin La Fontaine
type: Person
family_name: La Fontaine
firstName: Robin
workplace homepage: http://www.deltaxml.com/
member of: DeltaXML
Online Account: robinlafontaine

Autumn Cuellar
type: Person
holds role: 2013 Presenter
family_name: Cuellar
firstName: Autumn
workplace homepage: https://www.dessci.com/en
Online Account: b47
Online Account: autumnc
Speaker At: Autumn Cuellar's 2013 talk

Paul Topping
type: Person
family_name: Topping
firstName: Paul
workplace homepage: https://www.dessci.com/en
Online Account: http://www.linkedin.com/pub/paul-topping/0/17b/271

Stéphane Sire
type: Person
holds role: 2013 Presenter
family_name: Sire
firstName: Stéphane
workplace homepage: http://www.oppidoc.fr/en/accueil
Online Account: ssire
Speaker At: Stéphane Sire's 2013 talk

Christine Vanoirbeek
type: Person
family_name: Vanoirbeek
firstName: Christine
workplace homepage: http://www.oppidoc.fr/en/accueil

Philip Fennell
type: Person
holds role: 2013 Programme Committee Member
holds role: 2014 Programme Committee Member
holds role: 2015 Programme Committee Member
holds role: 2013 Presenter
holds role: 2014 Presenter
holds role: 2016 Programme Committee Member
family_name: Fennell
firstName: Philip
workplace homepage: http://www.marklogic.com/
member of: MarkLogic
Online Account: philipfennell
Speaker At: Philip Fennell's 2013 talk
Speaker At: Philip Fennell's 2014 talk

Rob Walpole
type: Person
holds role: 2013 Presenter
family_name: Walpole
firstName: Rob
Speaker At: Rob Walpole's 2013 talk

Catherine Dolbear
type: Person
holds role: 2013 Presenter
family_name: Dolbear
firstName: Catherine
workplace homepage: http://www.oup.com/
member of: Oxford University Press
Speaker At: Catherine Dolbear's 2013 talk

James Fuller
type: Person
holds role: 2013 Programme Committee Member
holds role: 2014 Programme Committee Member
holds role: 2015 Programme Committee Member
holds role: 2013 Presenter
holds role: 2015 Presenter
holds role: 2016 Programme Committee Member
family_name: Fuller
firstName: James
workplace homepage: http://www.marklogic.com/
member of: MarkLogic
Online Account: jimfuller
Online Account: xquery
Speaker At: James Fuller's 2013 talk
Speaker At: James Fuller's 2015 talk

Abel Braaksma
type: Person
holds role: 2013 Programme Committee Member
holds role: 2014 Programme Committee Member
holds role: 2015 Programme Committee Member
holds role: 2013 Presenter
holds role: 2014 Presenter
holds role: 2015 Presenter
holds role: 2016 Programme Committee Member
holds role: 2016 Presenter
family_name: Braaksma
firstName: Abel
workplace homepage: http://abrasoft.net/AbraSoftDnn
Online Account: abelbraaksma
Online Account: kandura
Speaker At: Abel Braaksma's 2013 talk
Speaker At: Abel Braaksma's 2014 talk
Speaker At: Abel Braaksma's 2015 talk
Speaker At: Abel Braaksma's 2016 talk

Adrian Warman
type: Person
holds role: 2013 Presenter
family_name: Warman
firstName: Adrian
member of: IBM
Online Account: warmana
Speaker At: Adrian Warman's 2013 talk

Sebastian Rahtz
type: Person
holds role: 2013 Presenter
family_name: Rahtz
firstName: Sebastian
workplace homepage: http://www.tei-c.org/index.xml
workplace homepage: http://www.ox.ac.uk/
workplace homepage: http://it.oucs.ox.ac.uk/
member of: University of Oxford
Online Account: http://uk.linkedin.com/pub/sebastian-rahtz/a/937/208
Online Account: rahtz
Speaker At: Sebastian Rahtz's 2013 talk

Lou Burnard
type: Person
family_name: Burnard
firstName: Lou
workplace homepage: http://www.tei-c.org/index.xml
workplace homepage: http://www.ox.ac.uk/
workplace homepage: http://it.oucs.ox.ac./uk
weblog: http://louburnard.wordpress.com
Online Account: louburnard
Online Account: louBurnard

Matt Kohl
type: Person
holds role: 2014 Presenter
family_name: Kohl
firstName: Matt
workplace homepage: http://www.oup.com/
workplace homepage: http://www.therightrhymes.com/
weblog: http://blog.oxforddictionaries.com/author/matt-kohl
member of: Oxford University Press
Online Account: http://uk.linkedin.com/pub/matt-kohl/44/363/250
Online Account: mattkohl
Speaker At: Matt Kohl's 2014 talk

Sandro Cirulli
type: Person
holds role: 2014 Presenter
holds role: 2015 Presenter
family_name: Cirulli
firstName: Sandro
workplace homepage: http://www.oup.com/
workplace homepage: http://www.sandrocirulli.net/
member of: Oxford University Press
Speaker At: Sandro Cirulli's 2015 talk

Phil Gooch
type: Person
family_name: Gooch
firstName: Phil
workplace homepage: http://www.oup.com/
Online Account: philgooch

Dino Fancellu
type: Person
family_name: Fancellu
firstName: Dino
Online Account: dinofancellu
Online Account: fancellu

George Bina
type: Person
holds role: 2014 Presenter
holds role: 2015 Presenter
family_name: Bina
firstName: George
workplace homepage: http://www.sync.ro/
workplace homepage: http://www.oxygenxml.com/
member of: oXygen
Online Account: http://ro.linkedin.com/pub/george-bina/1/917/760
Online Account: georgebina
Speaker At: George Bina's 2014 talk
Speaker At: George Bina's 2015 talk

William Narmontas
type: Person
holds role: 2014 Presenter
family_name: Narmontas
firstName: William
Online Account: scalawilliam
Online Account: ScalaWilliam
Speaker At: William Narmontas's 2014 talk

sameAs
type: Property
comment: The property that determines that two given individuals are equal.
domain: Thing
range: Thing

Elias Weingärtner
type: Person
holds role: 2014 Presenter
family_name: Weingärtner
firstName: Elias
weblog: http://www.weingaertner.org/
Online Account: http://de.linkedin.com/pub/elias-weingärtner/4/669/192
Speaker At: Elias Weingärtner's 2014 talk

Christoph Ludwig
type: Person
family_name: Ludwig
firstName: Christoph
Online Account: http://de.linkedin.com/pub/christoph-ludwig/7b/212/694

Celina Huang
type: Person
holds role: 2014 Presenter
family_name: Huang
firstName: Celina
workplace homepage: http://www.antennahouse.com/
member of: Antenna House
Online Account: http://www.linkedin.com/pub/celina-huang/22/197/869
Speaker At: Celina Huang's 2014 talk

Steven Pemberton
type: Person
holds role: 2014 Presenter
family_name: Pemberton
firstName: Steven
member of: Centrum Wiskunde and Informatica
Online Account: stevenpemberton
Speaker At: Steven Pemberton's 2014 talk
Speaker At: Steven Pemberton's 2015 talk
Speaker At: Steven Pemberton's 2016 talk

Kal Ahmed
type: Person
holds role: 2014 Presenter
family_name: Ahmed
firstName: Kal
workplace homepage: http://www.networkedplanet.com/
member of: Networked Planet
member of: XML Guild
Online Account: kalahmed
Online Account: kal ahmed
Online Account: kal
Speaker At: Kal Ahmed's 2014 talk

Robbert Broersma
type: Person
holds role: 2014 Presenter
family_name: Broersma
firstName: Robbert
workplace homepage: http://www.frameless.io/
member of: Frameless
Online Account: robbertbroersma
Online Account: robbert
Speaker At: Robbert Broersma's 2014 talk

Yolijn van der Kolk
type: Person
family_name: van der Kolk
firstName: Yolijn
workplace homepage: http://www.frameless.io/
member of: Frameless
Online Account: en
Online Account: yolijn
Online Account: Yolijn

Jorge Williams
type: Person
holds role: 2014 Presenter
family_name: Williams
firstName: Jorge
workplace homepage: http://www.rackspace.com/
member of: Rackspace
Online Account: a6b
Speaker At: Jorge Williams's 2014 talk

Eduardo Corrêa Gonçalves
type: Person
holds role: 2014 Presenter
family_name: Gonçalves
firstName: Eduardo Corrêa
workplace homepage: http://www.ic.uff.br/
Speaker At: Eduardo Gonçalves's 2014 talk

Vanessa Braganholo
type: Person
family_name: Braganholo
firstName: Vanessa
workplace homepage: http://www.ic.uff.br/
Online Account: vanbraganholo
Online Account: braganholo

Lech Rzedzicki
type: Person
holds role: 2014 Presenter
holds role: 2016 Presenter
family_name: Rzedzicki
firstName: Lech
workplace homepage: http://www.kode1100.com/
Online Account: lechrzedzicki
Online Account: xchaotic
Speaker At: Lech Rzedzicki's 2014 talk
Speaker At: Lech Rzedzicki's 2016 talk

2013 Conference Proceedings
type: Proceedings
has part: Nick Van den Bleeken's 2013 paper
has part: Eric Van der Vlist's 2013 paper
has part: O'Neil Delpratt's 2013 paper
has part: Tomos Hillman's 2013 paper
has part: Nigel Whitaker's 2013 paper
has part: Autumn Cuellar's 2013 paper
has part: Stéphane Sire's 2013 paper
has part: Philip Fennell's 2013 paper
has part: Rob Walpole's 2013 paper
has part: Catherine Dolbear's 2013 paper
has part: James Fuller's 2013 paper
has part: Abel Braaksma's 2013 paper
has part: Adrian Warman's 2013 paper
has part: Sebastian Rahtz's 2013 paper
related to Event: XML London 2013

Nick Van den Bleeken's 2013 paper
type: Paper
type: InProceedings
is part of: 2013 Conference Proceedings
creator: Nick Van den Bleeken
title: Building Rich Web Applications using XForms 2.0
page start: 9
page end: 14
month: June
year: 2013
related to Event: Nick Van den Bleeken's 2013 talk

Eric Van der Vlist's 2013 paper
type: Paper
type: InProceedings
is part of: 2013 Conference Proceedings
creator: Eric Van Der Vlist
title: When MVC becomes a burden for XForms
page start: 15
page end: 34
month: June
year: 2013
related to Event: Eric Van der Vlist's 2013 talk

O'Neil Delpratt's 2013 paper
type: Paper
type: InProceedings
is part of: 2013 Conference Proceedings
creator: O'Neil Delpratt
title: XML on the Web: is it still relevant?
page start: 35
page end: 48
month: June
year: 2013
related to Event: O'Neil Delpratt's 2013 talk

Tomos Hillman's 2013 paper
type: Paper
type: InProceedings
is part of: 2013 Conference Proceedings
creator: Tomos Hillman
creator: Richard Pineger
title: Practice what we Preach
page start: 49
page end: 56
month: June
year: 2013
related to Event: Tomos Hillman's 2013 talk

Nigel Whitaker's 2013 paper
type: Paper
type: InProceedings
is part of: 2013 Conference Proceedings
creator: Nigel Whitaker
creator: Robin La Fontaine
title: Optimizing XML for Comparison and Change
page start: 57
page end: 62
month: June
year: 2013
related to Event: Nigel Whitaker's 2013 talk

Autumn Cuellar's 2013 paper
type: Paper
type: InProceedings
is part of: 2013 Conference Proceedings
creator: Autumn Cuellar
creator: Paul Topping
creator: bob-mathews
title: What you need to know about the Maths Stack
page start: 63
page end: 68
month: June
year: 2013
related to Event: Autumn Cuellar's 2013 talk

Stéphane Sire's 2013 paper
type: Paper
type: InProceedings
is part of: 2013 Conference Proceedings
creator: Stéphane Sire
creator: Christine Vanoirbeek
title: Small Data in the large with Oppidum
page start: 69
page end: 79
month: June
year: 2013
related to Event: Stéphane Sire's 2013 talk

Philip Fennell's 2013 paper
type: Paper
type: InProceedings
is part of: 2013 Conference Proceedings
creator: Philip Fennell
title: Extremes of XML
page start: 80
page end: 86
month: June
year: 2013
related to Event: Philip Fennell's 2013 talk

Rob Walpole's 2013 paper
type: Paper
type: InProceedings
is part of: 2013 Conference Proceedings
creator: Rob Walpole
title: The National Archives Digital Records Infrastructure Catalogue
page start: 87
page end: 105
month: June
year: 2013
related to Event: Rob Walpole's 2013 talk

Catherine Dolbear's 2013 paper
type: Paper
type: InProceedings
is part of: 2013 Conference Proceedings
creator: Catherine Dolbear
creator: Shaun McDonald
title: From trees to graphs: creating Linked Data from XML
page start: 106
page end: 112
month: June
year: 2013
related to Event: Catherine Dolbear's 2013 talk

James Fuller's 2013 paper
type: Paper
type: InProceedings
is part of: 2013 Conference Proceedings
creator: James Fuller
title: xproc.xq - Architecture of an XProc processor
page start: 113
page end: 134
month: June
year: 2013
related to Event: James Fuller's 2013 talk

Abel Braaksma's 2013 paper
type: Paper
type: InProceedings
is part of: 2013 Conference Proceedings
creator: Abel Braaksma
title: Lazy processing of XML in XSLT for big data
page start: 135
page end: 144
month: June
year: 2013
related to Event: Abel Braaksma's 2013 talk

Adrian Warman's 2013 paper
type: Paper
type: InProceedings
is part of: 2013 Conference Proceedings
creator: Adrian Warman
title: Using Distributed Version Control Systems
page start: 145
page end: 151
month: June
year: 2013
related to Event: Adrian Warman's 2013 talk

Sebastian Rahtz's 2013 paper
type: Paper
type: InProceedings
is part of: 2013 Conference Proceedings
creator: Sebastian Rahtz
creator: Lou Burnard
title: A complete schema definition language for the Text Encoding Initiative
page start: 152
page end: 161
month: June
year: 2013
related to Event: Sebastian Rahtz's 2013 talk

Shaun McDonald
type: Person
family_name: McDonald
firstName: Shaun
workplace homepage: http://www.oup.com/
member of: Oxford University Press

Adam Retter
type: Person
holds role: 2013 Programme Committee Member
holds role: 2014 Programme Committee Member
holds role: 2015 Programme Committee Member
holds role: 2015 Presenter
holds role: 2016 Programme Committee Member
family_name: Retter
firstName: Adam
member of: XML Guild
Online Account: adamretter
Speaker At: Adam Retter's 2015 talk

Mohamed Zergaoui
type: Person
holds role: 2013 Programme Committee Member
holds role: 2014 Programme Committee Member
holds role: 2015 Programme Committee Member
holds role: 2016 Programme Committee Member
family_name: Zergaoui
firstName: Mohamed
workplace homepage: http://www.innovimax.fr/
member of: XML Guild
Online Account: innovimax

MarkLogic
type: Organization
name: MarkLogic Corporation
member: Philip Fennell
member: James Fuller
member: John Snelson
member: Norman Walsh
homepage: http://en.wikipedia.org/wiki/MarkLogic
about: MarkLogic
Online Account: marklogic
Sponsors Event: XML London 2014
Sponsors Event: XML London 2015

Organization
type: Class
label: Organisation @fr
label: Organizzazione @it
label: organización @es
comment: Represents a collection of people organized together into a community or other social, commercial or political structure. The group has some common purpose or reason for existence which goes beyond the set of people belonging to it and can act as an Agent. Organizations are often decomposable into hierarchical structures. It is recommended that SKOS lexical labels should be used to label the Organization. In particular `skos:prefLabel` for the primary (possibly legally recognized name), `skos:altLabel` for alternative names (trading names, colloquial names) and `skos:notation` to denote a code from a code list. Alternative names: _Collective_ _Body_ _Org_ _Group_
comment: Représente un groupe de personnes organisées en communauté où tout autre forme de structure sociale, commerciale ou politique. Le groupe a un but commun ou une raison d'être qui va au-delà de la somme des personnes qui en font partie et peut agir en tant que "Agent". Les organisations sont souvent décomposables en structures hiérarchisées. Il est recommandé que des labels lexicaux SKOS soient utilisés pour nommer l'Organisation. En particulier `skos:prefLabel` pour le nom principal (en général le nom légal), `skos:altLabel` pour les noms alternatifs (marques, sigles, appellations familières) et `skos:notation` pour indiquer un code provenant d'une liste de code. @fr
comment: Rappresenta una collezione di persone organizzate all'interno di una communità o di una qualche struttura sociale, commerciale o politica. Il gruppo condivide un obiettivo o una ragione d'essere che va oltre gli stessi membri appartenenti al gruppo e può agire come un Agent. Le organizzazioni si possono spesso suddividere in strutture gerarchiche. Si raccomanda di usare le label per l'Organization mediante le proprietà di SKOS. In particolare, `skos:prefLabel` per il nome principale (possibilmente un nome legalmente riconosciuto)”, `skos:altLabel` come nome alternativo (denominazione commerciale, denominazione colloquiale) e `skos:notation` per indicare un codice di una lista di codici. @it
comment: コミュニティー、その他の社会、商業、政治的な構造に共に編入された人々の集合を表わします。グループには、そこに属する人々を超えた、存在に対するある共通の目的や理由があり、エージェント（代理）を務めることができます。組織は、多くの場合、階層構造に分割できます。 @ja
comment: Grupo de personas que se organiza en una comunidad u otro tipo de estructura social, comercial o política. Dicho grupo tiene un objetivo o motivo común para su existencia que va más allá del conjunto de personas que lo forman y que puede actuar como “agente”. A menudo las organizaciones se pueden agrupar en estructuras jerárquicas. Se recomienda el uso de etiquetas de SKOS para denominar a cada “organización”. En concreto, `skos:prefLabel` para la denominación principal o recomendada (aquella reconocida legalmente, siempre que sea posible), `skos:altLabel` para denominaciones alternativas (nombre comercial, sigla, denominación por la que se conoce a la organización coloquialmente) y `skos:notation` para referirse al código que identifique a la organización en una lista de códigos. Denominaciones alternativas: _colectivo_ _corporación_ _grupo_ @es
subclass of: Agent
equivalentClass: Organization
disjointWith: Role
disjointWith: Membership
disjointWith: Site
disjointWith: Change Event
hasKey: identifier

FasterXML
type: Organization
member: Tatu Saloranta
Online Account: fasterxml-llc
Online Account: fasterxml
Online Account: FasterXML

Saxonica
type: Organization
member: Michael Kay
member: Debbie Lockett
member: O'Neil Delpratt
member: John Lumley
Online Account: saxonica-ltd
Online Account: saxonica
Online Account: Saxonica
Sponsors Event: XML London 2014
Sponsors Event: XML London 2015

Oxford University Press
type: Organization
member: Tomos Hillman
member: Richard Pineger
member: Catherine Dolbear
member: Matt Kohl
member: Shaun McDonald
Online Account: oxford-university-press
Online Account: oupacademic
Online Account: OUP

DeltaXML
type: Organization
member: Nigel Whitaker
member: Robin La Fontaine
member: Philip Fearon
Online Account: deltaxml-ltd
Online Account: deltaxml
Online Account: DeltaXML

IBM
type: Organization
member: Adrian Warman
Online Account: ibm

University of Oxford
type: Organization
member: Sebastian Rahtz
Online Account: university-of-oxford
Online Account: uniofoxford
Online Account: ox-cs

oXygen
type: Organization
name: SyncRO Soft
member: George Bina
Online Account: syncro-soft
Online Account: oxygenxml
Sponsors Event: XML London 2014
Sponsors Event: XML London 2013
Sponsors Event: XML London 2015

Antenna House
type: Organization
member: Celina Huang
member: Tony Graham
Online Account: antenna-house-inc
Online Account: antennainfo
Online Account: AntennaHouse
Sponsors Event: XML London 2014

Centrum Wiskunde and Informatica
type: Organization
member: Steven Pemberton
Online Account: cwi
Online Account: cwinl
Online Account: cwi-swat

Networked Planet
type: Organization
member: Kal Ahmed
Online Account: networked-planet

Frameless
type: Organization
member: Robbert Broersma
member: Yolijn van der Kolk
Online Account: frameless io
Online Account: frameless

Rackspace
type: Organization
member: Jorge Williams
Online Account: rackspace-hosting
Online Account: rackspace

BaseX
type: Organization
member: Christian Grün
Online Account: basex
Online Account: basexdb
Online Account: BaseXdb

eXistdb
type: Organization
Online Account: about
Online Account: existdb
Online Account: eXist-db

Mercator IT Solutions Ltd
type: Organization
Online Account: mercator-it-solutions-ltd
Online Account: MercatorIT
Sponsors Event: XML London 2013

OverStory Consulting Ltd
type: Organization
Online Account: overstory-consulting
Online Account: overstory
Sponsors Event: XML London 2013

3Ksoftware
type: Organization
Online Account: 3ksoftware-llc
Sponsors Event: XML London 2014

Xeditor
type: Organization
name: appsoft Technologies
Online Account: appsoft-technologies-gmbh
Online Account: xeditor
Sponsors Event: XML London 2014

XML Guild
type: Organization
member: Charles Foster
member: Michael Kay
member: Eric Van Der Vlist
member: Kal Ahmed
member: Adam Retter
member: Mohamed Zergaoui
member: Tony Graham
Online Account: about
Online Account: xmlguild

depiction
type: ObjectProperty
type: Property
comment: A depiction of some thing.
term status: testing
domain: Thing
range: Image
inverseOf: depicts
scope note: Used to link an agent with an image that depict it.

member of
type: ObjectProperty
type: Property
label: membre de @fr
label: membro di @it
label: es miembro de @es
comment: Indicates that a person is a member of the Organization with no indication of the nature of that membership or the role played. Note that the choice of property name is not meant to limit the property to only formal membership arrangements, it is also indended to cover related concepts such as affilliation or other involvement in the organization. Extensions can specialize this relationship to indicate particular roles within the organization or more nuanced relationships to the organization. Has an optional inverse, `org:hasmember`.
comment: Indique qu'une personne est membre de l'Organisation sans précision sur la nature de cet engagement ou du rôle joué. Notez que le choix du nom de cette propriété ne vise pas à la limiter aux seuls engagements formels, elle peut également couvrir des concepts reliés comme l'affiliation ou le bénévolat. Des extensions peuvent spécialiser cette relation pour indiquer des rôles particuliers au sein de l'Organisation or des relations plus nuancées avec elle. Possède une propriété inverse optionnelle, `org:hasmember`. @fr
comment: Indica che una persona è membro di una Organization senza una precisa indicazione sulla natura di questa appartenenza e sul suo ruolo. Si noti che la scelta del nome di questa proprietà non intende limitarla alla sola rappresentazione formalmente di un'appartenenza. La proprietà può coprire anche altri coinvolgimenti nell'organizzazione. Questa proprietà può essere specializzata per indicare ruoli all'interno organizzazione o relazioni di diverse tipologie. Ha `org:hasmember` come proprietà inversa opzionale. @it
comment: エージェント（人または他の組織）が組織のメンバーであることを示します。ただし、その構成員の本質や担う役割は示しません。プロパティー名の選択は、プロパティーを正式な構成員配置のみに制限することが目的ではないことに注意してください。所属や組織へのその他の関与などの関連する概念をカバーすることも意図されています。拡張により、この関係を特殊化し、組織内の特定の役割やよりニュアンスを含んだ組織との関係を示すことができます。 @ja
comment: Persona que pertenece a la organización o es miembro de la misma, sin que conste la naturaleza de dicha pertenencia o el papel que desempeña. Se debe tener en cuenta que la elección de una denominación para esta propiedad no significa que la propiedad esté limitada a ciertos tipos de pertenencia formales, sino que pretende cubrir conceptos relacionados como el de afiliación u otras formas de participación en la organización. Se puede hacer uso de extensiones para especializar esta relación de forma que incluya tipos específicos de pertenencia a las organizaciones o relaciones especiales con la organización. @es
domain: Agent
range: Organization
inverseOf: has member

2013 Programme Committee Member
type: Programme Committee Member
held by: Charles Foster
held by: Eric Van Der Vlist
held by: Philip Fennell
held by: James Fuller
held by: Abel Braaksma
held by: Adam Retter
held by: Mohamed Zergaoui
held by: Christian Grün
held by: John Snelson
held by: Lars Windauer
is role at: XML London 2013

2014 Programme Committee Member
type: Programme Committee Member
held by: Charles Foster
held by: Eric Van Der Vlist
held by: Philip Fennell
held by: James Fuller
held by: Abel Braaksma
held by: Adam Retter
held by: Mohamed Zergaoui
held by: Christian Grün
held by: John Snelson
held by: Lars Windauer
held by: Norman Walsh
is role at: XML London 2014

2015 Programme Committee Member
type: Programme Committee Member
held by: Charles Foster
held by: Eric Van Der Vlist
held by: Philip Fennell
held by: James Fuller
held by: Abel Braaksma
held by: Adam Retter
held by: Mohamed Zergaoui
held by: Christian Grün
held by: John Snelson
held by: Lars Windauer
held by: Norman Walsh
held by: Geert Bormans
is role at: XML London 2015

2013 Presenter
type: Presenter
held by: Tatu Saloranta
held by: Nick Van den Bleeken
held by: Eric Van Der Vlist
held by: O'Neil Delpratt
held by: Tomos Hillman
held by: Nigel Whitaker
held by: Autumn Cuellar
held by: Stéphane Sire
held by: Philip Fennell
held by: Rob Walpole
held by: Catherine Dolbear
held by: James Fuller
held by: Abel Braaksma
held by: Adrian Warman
held by: Sebastian Rahtz
is role at: XML London 2013

2014 Presenter
type: Presenter
held by: Michael Kay
held by: Eric Van Der Vlist
held by: Philip Fennell
held by: Abel Braaksma
held by: Matt Kohl
held by: George Bina
held by: William Narmontas
held by: Elias Weingärtner
held by: Celina Huang
held by: Steven Pemberton
held by: Kal Ahmed
held by: Robbert Broersma
held by: Jorge Williams
held by: Eduardo Corrêa Gonçalves
held by: Lech Rzedzicki
is role at: XML London 2014

Christian Grün
type: Person
holds role: 2013 Programme Committee Member
holds role: 2014 Programme Committee Member
holds role: 2015 Programme Committee Member
holds role: 2016 Programme Committee Member
family_name: Grün
firstName: Christian
workplace homepage: http://basex.org/
member of: BaseX
Online Account: http://de.linkedin.com/pub/christian-grün/0/577/172
Online Account: christiangruen
Online Account: ChristianGruen

John Snelson
type: Person
holds role: 2013 Programme Committee Member
holds role: 2014 Programme Committee Member
holds role: 2015 Programme Committee Member
holds role: 2016 Programme Committee Member
family_name: Snelson
firstName: John
workplace homepage: http://www.marklogic.com/
member of: MarkLogic
Online Account: johnsnelson
Online Account: jpcs

Lars Windauer
type: Person
holds role: 2013 Programme Committee Member
holds role: 2014 Programme Committee Member
holds role: 2015 Programme Committee Member
family_name: Windauer
firstName: Lars
Online Account: windauer

Norman Walsh
type: Person
holds role: 2014 Programme Committee Member
holds role: 2015 Programme Committee Member
holds role: 2015 Presenter
holds role: 2016 Programme Committee Member
family_name: Walsh
firstName: Norman
member of: MarkLogic
nickname: Norm
Online Account: normanwalsh
Online Account: ndw

nickname
type: DatatypeProperty
type: Property
comment: A short informal nickname characterising an agent (includes login identifiers, IRC and other chat nicknames).
term status: testing

Friend of a Friend (FOAF) vocabulary
type: Ontology
description: The Friend of a Friend (FOAF) RDF vocabulary, described using W3C RDF Schema and the Web Ontology Language.

Label Property
type: Class
comment: A foaf:LabelProperty is any RDF property with texual values that serve as labels.
term status: unstable

equivalentClass
type: Property
comment: The property that determines that two given classes are equivalent, and that is used to specify datatype definitions.
domain: Class
range: Class

Agent
type: Class
comment: An agent (eg. person, group, software or physical artifact).
term status: stable
equivalentClass: Agent
scope note: Used to describe any "agent" related to bibliographic items. Such agents can be persons, organizations or groups of any kind.

disjointWith
type: Property
comment: The property that determines that two given classes are disjoint.
domain: Class
range: Class

Agent
type: Class
equivalentClass: Agent
editorial note: BIBO assert that a dcterms:Agent is an equivalent class to foaf:Agent. This means that all the individuals belonging to the foaf:Agent class also belongs to the dcterms:Agent class. This way, dcterms:contributor can be used on foaf:Person, foaf:Organization, foaf:Agent and foaf:Group. Even if this link is not done in neither the FOAF nor the DCTERMS ontologies this is a wide spread fact that is asserted by BIBO.

Image
type: Class
comment: An image.
term status: stable
subclass of: Document
equivalentClass: ImageObject

PersonalProfileDocument
type: Class
comment: A personal profile RDF document.
term status: testing
subclass of: Document

Online Account
type: Class
comment: An online account.
term status: testing
subclass of: Thing

Online Gaming Account
type: Class
comment: An online gaming account.
term status: unstable
subclass of: Online Account

Online E-commerce Account
type: Class
comment: An online e-commerce account.
term status: unstable
subclass of: Online Account

Online Chat Account
type: Class
comment: An online chat account.
term status: unstable
subclass of: Online Account

InverseFunctionalProperty
type: Class
comment: The class of inverse-functional properties.
subclass of: ObjectProperty

gender
type: DatatypeProperty
type: Property
type: FunctionalProperty
comment: The gender of this Agent (typically but not necessarily 'male' or 'female').
term status: testing
domain: Agent
range: Literal

FunctionalProperty
type: Class
comment: The class of functional properties.
subclass of: Property

geekcode
type: DatatypeProperty
type: Property
comment: A textual geekcode for this person, see http://www.geekcode.com/geek.html
term status: archaic
domain: Person
range: Literal

DNA checksum
type: DatatypeProperty
type: Property
comment: A checksum for the DNA of some thing. Joke.
term status: archaic
range: Literal

sha1sum (hex)
type: DatatypeProperty
type: Property
comment: A sha1sum hash, in hex.
term status: unstable
domain: Document

jabber ID
type: DatatypeProperty
type: Property
type: InverseFunctionalProperty
comment: A jabber ID for something.
term status: testing
domain: Agent
range: Literal

AIM chat ID
type: DatatypeProperty
type: Property
type: InverseFunctionalProperty
comment: An AIM chat ID
term status: testing
domain: Agent
range: Literal
sub property of: nickname

Skype ID
type: DatatypeProperty
type: Property
comment: A Skype ID
term status: testing
domain: Agent
range: Literal
sub property of: nickname

ICQ chat ID
type: DatatypeProperty
type: Property
type: InverseFunctionalProperty
comment: An ICQ chat ID
term status: testing
domain: Agent
range: Literal
sub property of: nickname

Yahoo chat ID
type: DatatypeProperty
type: Property
type: InverseFunctionalProperty
comment: A Yahoo chat ID
term status: testing
domain: Agent
range: Literal
sub property of: nickname

MSN chat ID
type: DatatypeProperty
type: Property
type: InverseFunctionalProperty
comment: An MSN chat ID
term status: testing
domain: Agent
range: Literal
sub property of: nickname

lastName
type: DatatypeProperty
type: Property
comment: The last name of a person.
term status: testing
domain: Person
range: Literal

Given name
type: DatatypeProperty
type: Property
comment: The given name of some person.
term status: testing

Given name
type: DatatypeProperty
type: Property
comment: The given name of some person.
term status: archaic
scope note: This is the property we choose to describe the given name of a Person related to a bibliographic resource. This is the first name of a person.

familyName
type: DatatypeProperty
type: Property
comment: The family name of some person.
term status: testing
domain: Person
range: Literal

phone
type: ObjectProperty
type: Property
comment: A phone, specified using fully qualified tel: URI scheme (refs: http://www.w3.org/Addressing/schemes.html#tel).
term status: testing

page
type: ObjectProperty
type: Property
comment: A page or document about this thing.
term status: stable
domain: Thing
range: Document
inverseOf: topic

is primary topic of
type: Property
type: InverseFunctionalProperty
comment: A document that this thing is the primary topic of.
term status: stable
domain: Thing
range: Document
inverseOf: primary topic
sub property of: page

openid
type: ObjectProperty
type: Property
type: InverseFunctionalProperty
comment: An OpenID for an Agent.
term status: testing
domain: Agent
range: Document
sub property of: is primary topic of

tipjar
type: ObjectProperty
type: Property
comment: A tipjar document for this agent, describing means for payment and reward.
term status: testing
domain: Agent
range: Document
sub property of: page

plan
type: DatatypeProperty
type: Property
comment: A .plan comment, in the tradition of finger and '.plan' files.
term status: testing
domain: Person
range: Literal

made
type: ObjectProperty
type: Property
comment: Something that was made by this agent.
term status: stable
domain: Agent
range: Thing
inverseOf: maker

equivalentProperty
type: Property
comment: The property that determines that two given properties are equivalent.
domain: Property
range: Property

image
type: ObjectProperty
type: Property
comment: An image that can be used to represent some thing (ie. those depictions which are particularly representative of something, eg. one's photo on a homepage).
term status: testing
domain: Person
range: Image
sub property of: depiction

depicts
type: ObjectProperty
type: Property
comment: A thing depicted in this representation.
term status: testing
domain: Image
range: Thing
inverseOf: depiction

thumbnail
type: ObjectProperty
type: Property
comment: A derived thumbnail image.
term status: testing
domain: Image
range: Image

work info homepage
type: ObjectProperty
type: Property
comment: A work info homepage of some person; a page about their work for some organization.
term status: testing
domain: Person
range: Document

schoolHomepage
type: ObjectProperty
type: Property
comment: A homepage of a school attended by the person.
term status: testing
domain: Person
range: Document

knows
type: ObjectProperty
type: Property
comment: A person known by this person (indicating some level of reciprocated interaction between the parties).
term status: stable
domain: Person
range: Person

interest
type: ObjectProperty
type: Property
comment: A page about a topic of interest to this person.
term status: testing
domain: Agent
range: Document

topic_interest
type: ObjectProperty
type: Property
comment: A thing of interest to this person.
term status: testing
domain: Agent
range: Thing

publications
type: ObjectProperty
type: Property
comment: A link to the publications of this person.
term status: testing
domain: Person
range: Document

current project
type: ObjectProperty
type: Property
comment: A current project this person works on.
term status: testing
domain: Person
range: Thing

past project
type: ObjectProperty
type: Property
comment: A project this person has previously worked on.
term status: testing
domain: Person
range: Thing

funded by
type: ObjectProperty
type: Property
comment: An organization funding a project or person.
term status: archaic
domain: Thing
range: Thing

topic
type: ObjectProperty
type: Property
comment: A topic of some page or document.
term status: testing
domain: Document
range: Thing
inverseOf: page

primary topic
type: ObjectProperty
type: Property
type: FunctionalProperty
comment: The primary topic of some page or document.
term status: stable
domain: Document
range: Thing
inverseOf: is primary topic of

focus
type: ObjectProperty
type: Property
comment: The underlying or 'focal' entity associated with some SKOS-described concept.
term status: testing
domain: Concept
range: Thing

theme
type: ObjectProperty
type: Property
comment: A theme.
term status: archaic
domain: Thing
range: Thing

account
type: ObjectProperty
type: Property
comment: Indicates an account held by this agent.
term status: testing
domain: Agent
range: Online Account

account
type: ObjectProperty
type: Property
comment: Indicates an account held by this agent.
term status: archaic
domain: Agent
range: Online Account

account service homepage
type: ObjectProperty
type: Property
comment: Indicates a homepage of the service provide for this online account.
term status: testing
domain: Online Account
range: Document

account name
type: DatatypeProperty
type: Property
comment: Indicates the name (identifier) associated with this online account.
term status: testing
domain: Online Account
range: Literal

membershipClass
type: AnnotationProperty
type: Property
comment: Indicates the class of individuals that are a member of a Group
term status: unstable

birthday
type: DatatypeProperty
type: Property
type: FunctionalProperty
comment: The birthday of this Agent, represented in mm-dd string form, eg. '12-31'.
term status: unstable
domain: Agent
range: Literal

age
type: DatatypeProperty
type: Property
type: FunctionalProperty
comment: The age in years of some agent.
term status: unstable
domain: Agent
range: Literal

status
type: DatatypeProperty
type: Property
comment: A string expressing what the user is happy for the general public (normally) to know about their current activity.
term status: unstable
domain: Agent
range: Literal

Core organization ontology
type: Ontology
label: Ontologie des organisations @fr
label: Ontologia delle organizzazioni @it
label: Ontología de organizaciones @es
created: 2010-05-28
modified: 2010-06-09
modified: 2010-10-08
modified: 2012-09-30
modified: 2012-10-06
modified: 2013-02-15
modified: 2013-12-16
modified: 2014-01-02
modified: 2014-01-25
modified: 2014-02-05
modified: 2014-04-12
license: http://www.opendatacommons.org/licenses/pddl/1.0/
comment: Vocabulary for describing organizational structures, specializable to a broad variety of types of organization.
comment: Vocabolario per descrivere strutture organizzative, le quali possono essere specializzate in una vasta varietà di tipi di organizzazione @it
comment: Vocabulario para describir organizaciones, adaptable a una amplia variedad de ellas. @es
versionInfo: 0.8
contributor: Dave Reynolds
contributor: Dominique Guardiola
contributor: Antonio Maccioni
contributor: Giorgia Lodi
contributor: Shuji Kamitsuna
contributor: Guadalupe Aguado de Cea
contributor: Elena Montiel Ponsoda
contributor: Olga Ximena Giraldo
contributor: María Poveda Villalón

versionInfo
type: AnnotationProperty
comment: The annotation property that provides version information for an ontology or another OWL construct.
domain: Resource
range: Resource

contributor
type: ObjectProperty
scope note: Used to link a bibliographic item to one of its contributor: can be an author, an editor, a publisher, etc.

identifier
type: DatatypeProperty
type: Property
label: identifiant @fr
label: identificatore @it
label: tiene identificador @es
comment: Gives an identifier, such as a company registration number, that can be used to used to uniquely identify the organization. Many different national and international identier schemes are available. The org ontology is neutral to which schemes are used. The particular identifier scheme should be indicated by the datatype of the identifier value. Using datatypes to distinguish the notation scheme used is consistent with recommended best practice for `skos:notation` of which this property is a specialization.
comment: Donne un identifiant, comme par exemple le numéro d'enregistrement d'une entreprise, qui peut être utilisé comme identifiant unique pour l'Organisation. De nombreux schémas nationaux et internationaux sont disponibles. Cette ontologie reste neutre par rapport au schéma utilisé. Le schéma particulier utilisé devrait être indiqué par le `datatype` de la valeur de l'identifiant. Utiliser les datatypes pour distinguer les schémas de notation est cohérent avec les bonnes pratiques pour `skos:notation` dont cette propriété est une spécialisation. @fr
comment: Indica un identificatore univoco per l'organizzazione, come ad esempio la partita IVA di un'azienda. Molti schemi di identificazione a livello nazionale e internazionale sono disponibili allo scopo. L'ontologia ORG è neutrale rispetto allo schema da utilizzare. Lo schema di identificazione dovrebbe essere indicato dal datatype del valore dell'identificatore. L'uso del datatype per distinguere lo schema di identificazione è coerente con le best practice per `skos:notation`, di cui questa proprietà è una specializzazione. @it
comment: 組織を一意に識別するために使用できる会社登録番号などの識別子を与えます。 @ja
comment: Código o identificador, como por ejemplo el CIF de una empresa, que permite identificar de forma inequívoca a una organización. Existen muchos códigos de identificación tanto nacionales como internacionales. Esta ontología no obliga al uso de ningún esquema en concreto. Los códigos de identificación utilizados en cada caso se deberían indicar mediante el uso de la propiedad “datatype” del valor del identificador. El uso de la propiedad “datatype” para especificar el esquema de notación utilizado está en consonancia con las buenas prácticas recomendadas para el uso de la propiedad `skos:notation`, de la que esta propiedad es una especialización. @es
domain: Organization
sub property of: notation

hasKey
type: Property
comment: The property that determines the collection of properties that jointly build a key.
domain: Class
range: List

Formal Organization
type: Class
label: Organisation Formelle @fr
label: Organizzazione formale @it
label: organización formal @es
comment: An Organization which is recognized in the world at large, in particular in legal jurisdictions, with associated rights and responsibilities. Examples include a Corporation, Charity, Government or Church. Note that this is a super class of `gr:BusinessEntity` and it is recommended to use the GoodRelations vocabulary to denote Business classifications such as DUNS or NAICS.
comment: Une Organisation reconnue, en particulier par les juridictions locales, ayant des droits et des responsabilités. Exemples : entreprises, association à but non-lucratif, collectivité, église. Notez que c'est une super-classe de `gr:BusinessEntity` et qu'il est recommandé d'utiliser le vocabulaire GoodRelations pour indiquer les classifications économiques comme le code NACE. @fr
comment: Un'organizzazione che è riconosciuta a livello mondiale o, in generale, all'interno di una qualche giurisdizione, e che quindi possiede diritti e responsabilità. Ad esempio aziende, enti governativi, associazioni di volontariato. Si noti che questa è una superclasse di `gr:BusinessEntity` e che quindi è raccomandabile usare il vocabolario GoodRelations per esprimere classificazioni di tipo industriale e commerciale come DUNS e NAICS. @it
comment: 関連する権利と責任を有する（特に法的管轄区域において）世界中に広く認識されている組織。例には、企業、慈善団体、政府や教会が含まれます。 @ja
comment: Organización reconocida a nivel mundial, en particular en jurisdicciones legales, con derechos y responsabilidades asociadas. Algunos ejemplos son: organización corporativa, organización benéfica, organización gubernamental, organización religiosa. Se debe tener en cuenta que ésta es una superclase de `gr:BusinessEntity` y que se recomienda el uso del vocabulario GoodRelations para referirse a clasificaciones de negocios tales como DUNS o NAICS. @es
subclass of: Organization

OrganizationalUnit
type: Class
label: Unité opérationnelle @fr
label: Unità Organizzativa @it
label: unidad organizativa @es
comment: An Organization such as a University Support Unit which is part of some larger FormalOrganization and only has full recognition within the context of that FormalOrganization, it is not a Legal Entity in its own right. Units can be large and complex containing other Units and even FormalOrganizations. Alternative names: _OU_ _Unit_ _Department_
comment: Une organisation telle que le support informatique d'une université, qui fait partie d'une Organisation Formelle plus importante et qui ne peut être reconnue qu'en tant que membre de cette organisation supérieure, ce n'est pas une entité légale en elle-même. Les unités opérationnelles peuvent être étendues, complexes et inclure elles-mêmes d'autres branches ou Unités Opérationnelles, voire des Organisations Formelles. @fr
comment: Un'organizzazione come ad esempio l'unità dei sistemi informativi che è parte di una più grande FormalOrganization e che, pur essendo riconosciuta nel contesto della propria organizzazione di riferimento, non è legalmente riconosciuta come entità a sé stante. Le unità possono essere ampie e complesse e contenere al loro interno sia altre unità che addirittura FormalOrganization. @it
comment: あるより大きな組織の一部であり、その組織の中においてのみ完全に認識される部局や支援部署などの組織です。特に、その単位はそれ自体では法的実体と見なされません。 @ja
comment: Organización que forma parte de una organización formal más amplia, como el servicio de informática o centro de cálculo de una universidad, y que sólo tiene reconocimiento pleno en el contexto de dicha organización formal, pero que no es una entidad legal propiamente dicha. Estas unidades pueden ser amplias y complejas, e incluir a otras unidades o incluso a otras organizaciones formales. Denominaciones alternativas: departamento. @es
subclass of: Organization

subOrganization of
type: ObjectProperty
type: Property
label: sous-Organization de @fr
label: sotto-Organization di @it
label: es suborganización de @es
comment: Represents hierarchical containment of Organizations or OrganizationalUnits; indicates an Organization which contains this Organization. Inverse of `org:hasSubOrganization`.
comment: Représente une relation hierarchique des Organisations ou des Unités Opérationnelles; indique une Organisation sujet qui contient cette Organisation. Inverse de `org:hasSubOrganization`. @fr
comment: Rappresenta un contenimento gerarchico di una Organization o di una OrganizationalUnit. È l'inverso di `org:hasSubOrganization`. Ha nome come nome alternativo hasSubOrg. @it
comment: 組織または組織単位の階層的包含を表わします。この組織を含む組織を示します。 @ja
comment: Distribución jerárquica de organizaciones o unidades. Indica que una organización contiene a otra organización. Es la relación inversa de `org:hasSubOrganization` @es
domain: Organization
range: Organization
inverseOf: has SubOrganization
sub property of: transitive sub-organization

transitive sub-organization
type: ObjectProperty
type: TransitiveProperty
type: Property
label: sous-Organization transitive de @fr
label: sotto-Organization transitiva @it
label: es suborganización de manera transitiva de @es
label: es suborganización de (transitiva) @es
comment: The transitive closure of subOrganizationOf, giving a representation of all organizations that contain this one. Note that technically this is a super property of the transitive closure so it could contain additional assertions but such usage is discouraged.
comment: La version transitive de la propriété subOrganizationOf, renvoie une représentation de toutes les organisations qui contiennent celle-ci. Notez que ceci est une super-propriété de la relation transitive donc elle pourrait contenir des assertions additionnelles mais cet usage n'est pas recommandé. @fr
comment: È la chiusura transitiva di subOrganizationOf, quindi rappresenta tutte le organizzazioni che la contengono. Tecnicamente, essendo una chiusura transitiva, può contenere asserzioni che non la riguardano e quindi il suo uso è sconsigliato. @it
comment: subOrganizationOfの推移閉包で、これを含むすべての組織の表現を与える。技術的に、これが推移閉包のスーパープロパティーであるため、追加の言明を含むことができますが、そのような使用法はお勧めできないことに注意してください。 @ja
comment: La versión transitiva de la propiedad “subOrganizationOf”, es decir, la representación de todas las organizaciones en las que esta está contenida. Téngase en cuenta que desde el punto de vista técnico esta es una propiedad que contiene a todas las propiedades transitivas, de forma que podría contener afirmaciones adicionales, aunque su uso no está aconsejado. @es
domain: Organization
range: Organization

has SubOrganization
type: ObjectProperty
type: Property
label: a une Sous-Organization @fr
label: ha sotto-Organization @it
label: tiene suborganización @es
comment: Represents hierarchical containment of Organizations or Organizational Units; indicates an organization which is a sub-part or child of this organization. Inverse of `org:subOrganizationOf`.
comment: Indique le statut de dépendance hiérarchique pour des Organisations ou des Unités Opérationnelles; indique une Organisation qui est une sous-partie ou une branche d'une Organisation plus large. C'est la propriété inverse de `org:subOrganizationOf`. @fr
comment: Rappresenta un contenimento gerarchico di una Organization o di una OrganizationalUnit. Indica una organizzazione che è parte di una organizzazione più grande. È l'inverso di `org:subOrganizationOf`. @it
comment: 組織または組織単位の階層的包含を表わします。この組織のサブパートまたは子である組織を示します。 @ja
comment: Organización jerárquica de organizaciones o unidades. Indica que una organización es parte de otra organización más amplia o pertenece a ella. Es la relación inversa de `org:subOrganizationOf`. @es
domain: Organization
range: Organization
inverseOf: subOrganization of

purpose
type: Property
label: but @fr
label: obiettivo @it
label: tiene objetivo @es
comment: Indicates the purpose of this Organization. There can be many purposes at different levels of abstraction but the nature of an organization is to have a reason for existence and this property is a means to document that reason. An Organization may have multiple purposes. It is recommended that the purpose be denoted by a controlled term or code list, ideally a `skos:Concept`. However, the range is left open to allow for other types of descriptive schemes. It is expected that specializations or application profiles of this vocabulary will constrain the range of the purpose. Alternative names: _remit_ _responsibility_ (esp. if applied to OrganizationalUnits such as Government Departments).
comment: Indique le but de cette Organisation. Il peut exister plusieurs buts à différents niveaux d'abstraction mais la nature d'une organisation est d'avoir une raison d'exister et cette propriété doit servir à documenter cette raison d'être. Une Organisation peut avoir plusieurs Buts. Il est recommandé que le but soit libellé à l'aide d'un vocabulaire contrôlé ou autre code établi, idéalement avec un concept `skos:Concept`. Toutefois, le champ de cette propriété est laissé ouvert et pourrait accepter d'autres schémas de description. Il est préférable que les spécialisations ou les profils d'applications de ce vocabulaire contraignent le champ de cette propriété. @fr
comment: Indica l'obiettivo di questa Organization. In generale, si possono esprimere gli obiettivi di un'organizzazione secondo diversi livelli di astrazione, ma la natura stessa dell'organizzazione ha una ragione d'essere ed è proprio questa che deve essere catturata con tale proprietà. Inoltre, un'Organization può avere obiettivi multipli. È raccomandabile che l'obiettivo faccia parte di una code list, e che sia preferibilmente un `skos:Concept`. Ad ogni modo, il codominio della proprietà è lasciato aperto per consentire altri tipi di di descrizione. Conseguentemente, eventuali specializzazioni o profili applicativi possono utilizzare quel vocabolario come codominio della proprietà. @it
comment: この組織の目的を示します。異なる抽象レベルの多くの目的がありえますが、組織の本質は存在理由を持つことであり、このプロパティーはその理由をドキュメント化する手段です。組織は、複数の目的を持っている可能性があります。 @ja
comment: Finalidad u objetivo de la organización. La organización puede tener muchos objetivos a diferentes niveles de abstracción, pero en la naturaleza de las organizaciones está el tener una razón para existir, y la finalidad de esta propiedad es documentar dicha razón. La organización podrá tener más de un objetivo. Se recomienda el uso de vocabularios controlados o listas de códigos para indicar el objetivo, preferentemente mediante el uso de un `skos:Concept`. Sin embargo, el rango no está predeterminado, de forma que otros tipos de esquemas descriptivos tiene cabida. Se espera que ciertas especializaciones de este vocabulario o ciertos perfiles de aplicaciones restrinjan el rango del objetivo. Denominaciones alternativas: área_ _jurisdicción_ _ responsabilidad _ (especialmente cuando se aplica a unidades tales como ministerios o divisiones administrativas de los gobiernos) @es
domain: Organization

has Unit
type: ObjectProperty
type: Property
label: possède une Unité @fr
label: ha Unit @it
label: contiene unidad @es
comment: Indicates a unit which is part of this Organization, e.g. a Department within a larger FormalOrganization. Inverse of `org:unitOf`.
comment: Indique une Unité qui fait partie d'une Organisation, par exemple un Départment au sein d'une Organisation Formelle plus large. Inverse de `org:unitOf`. @fr
comment: Indica un'unità che è parte di questa Organization, come ad esempio un dipartimento facente parte di una più ampia FormalOrganization. È l'inverso di `org:unitOf`. @it
comment: 例えば、より大きな組織内の部局など、この組織の一部である単位を示します。 @ja
comment: Unidad que es parte de la organización, como, por ejemplo, un departamento incluido en una organización formal más amplia. @es
domain: Formal Organization
range: OrganizationalUnit
inverseOf: unit Of
sub property of: has SubOrganization

unit Of
type: ObjectProperty
type: Property
label: unité de @fr
label: unità di @it
label: es unidad de @es
comment: Indicates an Organization of which this Unit is a part, e.g. a Department within a larger FormalOrganization. This is the inverse of `org:hasUnit`.
comment: Indique l'Organisation dont cette Organisation ou Unité fait partie, par exemple un Départment au sein d'une Organisation Formelle plus large. Inverse de `org:hasUnit`. @fr
comment: Indica un Organization di cui questa Unit fa parte, come ad esempio un dipartimento all'interno di una più vasta FormalOrganization. È l'inverso di `org:hasUnit`. @it
comment: 例えば、より大きな組織内の部局など、この単位がその一部分である組織を示します。 @ja
comment: Organización de la que es parte esta unidad, por ejemplo, un departamento incluido en una organización formal más amplia. @es
domain: OrganizationalUnit
range: Formal Organization
inverseOf: has Unit
sub property of: subOrganization of

classification
type: ObjectProperty
type: Property
label: classificazione @it
label: pertenece a la clasificación @es
comment: Indicates a classification for this Organization within some classification scheme. Extension vocabularies may wish to specialize this property to have a range corresponding to a specific `skos:ConceptScheme`. This property is under discussion and may be revised or removed - in many cases organizations are best categorized by defining a sub-class hierarchy in an extension vocabulary.
comment: Indique une classification pour cette Organisation dans le cadre d'un schéma de classification. Il est possible de spécialiser cette propriété en utilisant un vocabulaire spécialisé pour que le champ corresponde à un concept spécifique `skos:ConceptScheme`. Cette propriété est en discussion est pourrait être révisée ou supprimée - dans de nombreux cas, les organisations sont mieux catégorisées par une hiérarchie de sous-classe dans un vocabulaire externe. @fr
comment: Indica una classificazione per questa Organization all'interno di un qualche schema di classificazione. Alcuni vocabolari potrebbero voler specializzare questa proprietà per avere un codominio corrispondente a uno specifico `skos:ConceptScheme`. Si noti che la presenza di questa proprietà è ancora in fase di discussione e potrebbe essere revisionata o rimossa. @it
comment: ある分類表内のこの組織に対する分類を示します。 アプリケーションがorg:Organizationのサブクラスを組織的なカテゴリーを表わす手段として定義することも許容されることに注意してください。 @ja
comment: Ordenación jerárquica que se hace de una organización dentro de un esquema de clasificación. Es posible que algunos vocabularios especifiquen esta propiedad de forma que el rango se corresponda con un `skos:ConceptScheme` específico. La conveniencia de incluir esta propiedad se está debatiendo y puede que se revise o elimine (en muchos casos las organizaciones se clasifican mejor si se define una jerarquía de subclases en un vocabulario aparte) @es
domain: Organization
range: Concept

linked to
type: ObjectProperty
type: Property
label: relié à @fr
label: collegato a @it
label: está relacionado con @es
label: está relacionada con @es
comment: Indicates an arbitrary relationship between two organizations. Specializations of this can be used to, for example, denote funding or supply chain relationships.
comment: Indique une relation arbitraire entre deux Organisations. Des spécialisations peuvent être utilisées pour, par exemple, qualifier une relation de fournisseur ou de financeur. @fr
comment: Indica una relazione arbitraria tra due organizzazioni. Ad esempio, specializzazioni di questa proprietà possono essere usate per denotare relazioni particolari tipo il finanziamento o la fornitura. @it
comment: 2つの組織の任意の関係を示します。 @ja
comment: Relación arbitraria entre dos organizaciones. Las especializaciones de esta relación se pueden utilizar para denotar relaciones de financiación o suministro, entre otras. @es
domain: Organization
range: Organization

has member
type: ObjectProperty
type: Property
label: possède un membre @fr
label: ha membro @it
label: tiene miembro @es
comment: Indicates a person who is a member of the subject Organization. Inverse of `org:memberOf`, see that property for further clarification. Provided for compatibility with `foaf:member`.
comment: Indique une personne membre de l'Organisation sujet. Inverse de `org:memberOf`, voyez la description de cette propriété pour plus de précisions. Fourni pour la compatibilité avec `foaf:member`. @fr
comment: Indica una persona che è membro della data Organization. È l'inverso di `org:memberOf` ed è fornita per compatibilità con `foaf:member`. @it
comment: 対象組織のメンバーであるエージェント（人または他の組織）を示します。org:memberOfの逆。さらに明確な説明については、そのプロパティーを参照してください。 @ja
comment: Persona que es miembro de la organización en cuestión. Es la relación inversa de `org:memberOf`, véase la descripción de esa propiedad para más detalles. Se prevé compatibilidad con foaf:member`. @es
domain: Organization
range: Agent
inverseOf: member of
equivalentProperty: member

reports to
type: ObjectProperty
type: Property
label: est subordonné à @fr
label: riporta a @it
label: responde ante @es
comment: Indicates a reporting relationship as might be depicted on an organizational chart. The precise semantics of the reporting relationship will vary by organization but is intended to encompass both direct supervisory relationships (e.g. carrying objective and salary setting authority) and more general reporting or accountability relationships (e.g. so called _dotted line_ reporting).
comment: Indique une relation de subordination comme elle pourrait figurer dans un organigramme. La sémantique précise de cette subordination pourra varier selon l'Organisation mais vise à englober aussi bien les relations hiérarchiques directes (définition d'objectifs, montant du salaire) que des relations plus générales ou organisationnelles (les liens en pointillés dans les organigrammes). @fr
comment: Indica una relazione di subordinazione all'interno dell'organigramma. La semantica precisa può variare a seconda dell'organizzazione, per esempio può essere usata per rappresentare la proprietà di supervisione oppure per le relazioni di rendicontazione. @it
comment: 組織図で描かれるかもしれないような上下関係を示します。エージェント間またはエージェントが就くことができるポスト間の上下関係を直接的に示すために使用できます。 @ja
comment: Relación de subordinación que se representa en los organigramas de las organizaciones. La semántica de la relación de subordinación varía según las organizaciones, pero su intención es abarcar tanto a las relaciones de supervisión directa (por ejemplo, aquellas en las que la autoridad determina los objetivos o el salario) como a las relaciones de subordinación más generales (por ejemplo, las llamadas líneas de autoridad o de mando (y responsabilidad) (http://www.promonegocios.net/organigramas/tipos-de-organigramas.html)). @es
domain: Class
  unionOf: Agent
  unionOf: Post
domain: Class
  unionOf: Agent
  unionOf: Post
range: Class
  unionOf: Agent
  unionOf: Post
range: Class
  unionOf: Agent
  unionOf: Post

Post
type: Class
label: Poste @fr
label: Impiego @it
label: puesto @es
comment: A Post represents some position within an organization that exists independently of the person or persons filling it. Posts may be used to represent situations where a person is a member of an organization ex officio (for example the Secretary of State for Scotland is part of UK Cabinet by virtue of being Secretary of State for Scotland, not as an individual person). A post can be held by multiple people and hence can be treated as a organization in its own right.
comment: Un Poste représente une position au sein d'une Organisation qui existe indépendamment de la personne ou des personnes qui le remplissent. Les postes peuvent être utilisés pour représenter des situations où une personne est membre d'une Organisation d'office (par exemple, le Secrétaire d'Etat pour l'Ecosse fait partie du Cabinet du Royaume-Uni du fait d'être Secrétaire d'Etat pour l'Ecosse, non pas comme une personne physique). Un poste après peut être occupé par plusieurs personnes et peut donc être considéré comme une Organisation à part entière. @fr
comment: Un Impiego rappresenta una posizione all'interno dell'organizzazione che esiste indipendentemente dalla persona che la ricopre. Gli impieghi possono essere utilizzati per le situazioni in cui una persona è membro di un'organizzazione o di un ufficio (ad esempio un segretario di stato). Un Impiego può essere ricoperto da più persone. @it
comment: ポストは、それを埋める人（人々）とは無関係に存在する組織内のある位置を表わします。ポストは、人が職権上、組織のメンバーである状況を表わすために使用できます（例えば、スコットランド大臣は、個人としてではなく、スコットランド大臣であることにより、英国内閣の一部です）。ポストは、複数の人々によって保持されることが可能だあるため、それ自体を組織として扱うことができます。 @ja
comment: Puesto o posición que representa algún tipo de empleo dentro de una organización, que existe independientemente de la persona o personas que lo desempeñan. Esta clase puede utilizarse para representar situaciones en las que una persona es miembro de una organización ex oficio (por ejemplo, el Secretario de Estado escocés es parte del Gabinete del gobierno británico por virtud de ser Secretario de Estado en Escocia, y no como individuo). Un puesto puede ser desempeñado por múltiples individuos y de aquí que sea tratado como una organización en sí misma. @es

unionOf
type: Property
comment: The property that determines the collection of classes or data ranges that build a union.
domain: Class
range: List

Role
type: Class
label: Rôle @fr
label: Ruolo @it
label: actividad @es
comment: Denotes a role that a Person or other Agent can take in an organization. Instances of this class describe the abstract role; to denote a specific instance of a person playing that role in a specific organization use an instance of `org:Membership`. It is common for roles to be arranged in some taxonomic structure and we use SKOS to represent that. The normal SKOS lexical properties should be used when labelling the Role. Additional descriptive properties for the Role, such as a Salary band, may be added by extension vocabularies.
comment: Indique le rôle qu'une Personne ou un autre Agent peut avoir dans une Organisation. Les instances de cette classe décrivent le rôle dans l'absolu; pour indiquer une personne ayant ce rôle spécifique dans une Organisation, utilisez une instance de `org:Membership`. Il est courant que les rôles soient organisés dans une sorte de taxonomie, ce qui peut être représenté avec SKOS. Les propriétés de libellés standards de SKOS devraient être utilisées pour libeller le Rôle. D'autres propriétés additionnelles pour ce rôle, comme une fourchette de Salaire peuvent être ajoutées par une extension de ce vocabulaire. @fr
comment: Indica il ruolo che una Person o un altro Agent può assumere in un'organizzazione. Le istanze di questa classe descrivono un ruolo astratto; per esprimere il ruolo che una precisa persona ricopre in un'organizzazione si usi un'istanza di `org:Membership`. È comune organizzare i ruoli in una qualche struttura tassonomica e quindi si raccomanda SKOS per questo. Altre proprietà descrittive per il Role, come salario, possono essere aggiunte mediante l'uso di altri vocabolari. @it
comment: 人またはその他のエージェントが組織で担うことができる役割を表わします。この種のインスタンスは、抽象的な役割を記述します。特定の組織でその役割を担っている人の特定のインスタンスを示すためには、org:Membershipのインスタンスを使用します。 @ja
comment: Función que una persona o agente desempeña en el seno de una organización. Las instancias de esta clase describen la actividad en abstracto; si lo que se pretende es incluir una instancia que refleje la función o actividad que desempeña una persona en concreto en una organización específica, se indica el uso de instancias de la clase `org:Membership`. Es común que dichas actividades se representen en una estructura taxonómica mediante SKOS. Las propiedades léxicas de SKOS deberían utilizarse a la hora de denominar o etiquetar la actividad desempeñada. Para añadir propiedades descriptivas adicionales, como rango salarial, se tendrá que recurrir a vocabularios externos. @es
subclass of: Concept
disjointWith: Membership
disjointWith: Site
disjointWith: Change Event

Membership
type: Class
label: Engagement @fr
label: Appartenenza @it
label: membresía @es
comment: Indicates the nature of an Agent's membership of an organization. Represents an n-ary relation between an Agent, an Organization and a Role. It is possible to directly indicate membership, independent of the specific Role, through use of the `org:memberOf` property.
comment: Indique la nature de l'engagement d'un Agent dans une Organisation. Représente une relation n-aire entre un Agent, une Organisation et un Role. Il est possible d'indiquer directement l'appartenance à une organisation, independemment d'un rôle spécifique, à travers l'usage de la propriété `org:memberOf`. @fr
comment: Indica la natura della relazione di appartenenza di un Agent in un'organizzazione. Rappresenta una relazione n-aria tra un'Agent, un Organization e un Role. È possibile indicare direttamente la membership, indipendentemente dallo specifico Role, attraverso l'uso della proprietà `org:memberOf` @it
comment: 組織のエージェントの構成員の本質を示します。 @ja
comment: Pertenencia o afiliación de un agente a una organización. Es una relación n-aria entre un agente, una organización y una actividad. Es posible indicar pertenencia mediante el uso de la propiedad `org:memberOf`, independientemente de la actividad específica que se desempeñe. @es
disjointWith: Site
disjointWith: Change Event

member
type: ObjectProperty
type: Property
type: FunctionalProperty
label: membre @fr
label: membro @it
label: es condición de miembro sobre agente @es
comment: Indicates the Person (or other Agent including Organization) involved in the Membership relationship. Inverse of `org:hasMembership`
comment: Indique une personne (ou tout autre Agent, y compris une Organisation) impliqué dans la relation d'Engagement. Inverse de `org:hasMembership` @fr
comment: Indica la Person (o un altro Agent) coinvolto in una relazione di Membership. È l'inverso di `org:hasMembership`. @it
comment: 構成員関係に含まれている人（または、組織を含んでいる他のエージェント）を示します。 @ja
comment: Persona (u otro agente, incluyendo una organización) que participa en la relación de membresía. Es la relación inversa de `org:hasMembership`. @es
domain: Membership
range: Agent
inverseOf: membership

organization
type: ObjectProperty
type: Property
type: FunctionalProperty
label: organisation @fr
label: organizzazione @it
label: es condición de miembro sobre organización @es
comment: Indicates Organization in which the Agent is a member.
comment: Indique l'Organization dont l'agent est membre. @fr
comment: Indica l'Organization in cui l'Agent è un membro. @it
comment: エージェントがメンバーである組織を示します。 @ja
comment: Organización a la que pertenece el agente en calidad de miembro. @es
domain: Membership
range: Organization

role
type: ObjectProperty
type: Property
label: rôle @fr
label: ruolo @it
label: desempeña la actividad de @es
comment: Indicates the Role that the Agent plays in a Membership relationship with an Organization.
comment: Indique le Rôle de l'Agent dans son Engagement avec l'Organisation. @fr
comment: Indica il Role che un Agent ricopre in una relazione di Membership con una Organization @it
comment: エージェントが組織との構成員関係において担う役割を示します。ポストの保持者が担う役割を示すためにorg:Postで用いることもできます。 @ja
comment: Actividad que el agente desempeña en una relación de pertenencia a una organización. @es
domain: Class
  unionOf: Membership
  unionOf: Post
domain: Class
  unionOf: Membership
  unionOf: Post
range: Role

membership
type: ObjectProperty
type: Property
label: engagement @fr
label: appartenenza @it
label: tiene membresía @es
comment: Indicates a membership relationship that the Agent plays. Inverse of `org:member`.
comment: Indique pour cet Agent un engagement dans une Organisation. Inverse de `org:member`. @fr
comment: Indica una relazione di appartenenza che coinvolge un Agent. È l'inverso di `org:member`. @it
comment: エージェントが担う構成員関係を示します。 @ja
comment: Relación de pertenencia o afiliación a una organización en la que el agente desempeña un cargo o función. Es la relación inversa de `org:member`. @es
domain: Agent
range: Membership
inverseOf: member

member During
type: ObjectProperty
type: Property
label: durée d'engagement @fr
label: membro durante @it
label: es miembro durante @es
comment: Optional property to indicate the interval for which the membership is/was valid.
comment: Propriété optionnelle pour indiquer l'intervalle durant lequel l'engagemnet est ou était valide. @fr
comment: Proprietà opzionale per indicare l'intervallo per il quale l'appartenenza è/è stata valida. @it
comment: 構成員が有効である／であった期間を示すためのオプションのプロパティー。 @ja
comment: Propiedad opcional que indica el periodo durante el cual la relación de membresía o pertenencia a una organización se mantiene en vigencia. @es
domain: Membership

role (property)
type: AnnotationProperty
type: Property
label: rôle (propriété) @fr
label: ruolo (proprietà) @it
label: desempeña la actividad de (propiedad) @es
comment: This is a metalevel property which is used to annotate an `org:Role` instance with a sub-property of `org:memberOf` that can be used to directly indicate the role for easy of query. The intended semantics is a Membership relation involving the Role implies the existence of a direct property relationship through an inference rule of the form: `{ [] org:member ?p; org:organization ?o; org:role [org:roleProperty ?r] } -> {?p ?r ?o}`.
comment: Ceci est une méta-propriété utilisée pour annoter une instance de `org:Role` ayant une sous-propriété `org:memberOf` qui peut être utilisée pour indiquer directement le rôle et pouvoir faire des requêtes plus facilement. La sémantique visée est un Engagement impliquant l'existence d'une relation de propriété directe à travers d'une règle d'inférence de la forme: `{ [] org:member ?p; org:organization ?o; org:role [org:roleProperty ?r] } -> {?p ?r ?o}`. @fr
comment: Questa è una meta-proprietà usata per annotare un'istanza di `org:Role` con una sotto-proprietà di `org:memberOf` e può essere usata per indicare direttamente il ruolo per facilitare un'interrogazione sui dati. @it
comment: これは、クエリが容易になるように役割を直接的に示すために使用できるorg:memberOfのサブプロパティーでorg:Roleインスタンスを注釈するために用いられるメタレベルのプロパティーです。 @ja
comment: Meta-propiedad que se utiliza para anotar una instancia de `org:Role` con una sub-propiedad de `org:memberOf`, que puede ser utilizada para indicar directamente la actividad a fin de facilitar las consultas a los datos. The intended semantics is that a Membership relation involving the Role implies the existence of a direct property relationship through an inference rule of the form: { [] org:member ?a; org:organization ?o; org:role [org:roleProperty ?r] } -> {?a ?r ?o} @es
domain: Role
range: Property

head of
type: ObjectProperty
type: Property
label: responsable de @fr
label: responsabile di @it
label: es director ejecutivo de @es
comment: Indicates that a person is the leader or formal head of the Organization. This will normally mean that they are the root of the `org:reportsTo` (acyclic) graph, though an organization may have more than one head.
comment: Indique qu'une personne est le directeur ou le responsable formel d'une Organisation. Ceci indique souvent qu'il est au sommet de du graphe acyclique des `org:reportsTo`, même si une organisation peut avoir plus d'un responsable. @fr
comment: Indica che una persona è leader o responsabile formale di una Organization. Questo significa che la persona è alla radice del grafo (aciclico) creato dalle `org:reportsTo`, sebbene un'organizzazione possa avere più di un responsabile. @it
comment: 人（または他のエージェント）が組織のリーダーや正式なトップであることを示します。 @ja
comment: Persona que es jefe o jefa, representante ,,director o directora de la organización. Esto significa que dicha persona es el rango de la relación `org:reportsTo` en el organigrama de la organización (acíclico), aunque una organización puede tener más de un jefe. @es
domain: Person
range: Organization
sub property of: member of

head
type: Role
label: responsable @fr
label: responsabile @it
label: director ejecutivo @es
label: directora ejecutiva @es
comment: A role corresponding to the `org:headOf` property
comment: Un rôle correspondant à la propriété `org:headOf` @fr
comment: Un ruolo corrispondente alla proprietà `org:headOf`. @it
comment: Actividad correspondiente a la propiedad `org:headOf`. @es
role (property): head of

remuneration
type: ObjectProperty
type: Property
label: rémuneration @fr
label: remunerazione @it
label: recibe remuneración @es
comment: Indicates a salary or other reward associated with the role. Typically this will be denoted using an existing representation scheme such as `gr:PriceSpecification` but the range is left open to allow applications to specialize it (e.g. to remunerationInGBP).
comment: Indique un salaire ou tout autre compensation associée au Rôle. Typiquement, ceci sera annoté en utilisant un schéma existant comme `gr:PriceSpecification` mais le champ de cette propriété est laissé ouvert afin de permettre aux applications de la spécialiser (par exemple remunerationEuro). @fr
comment: Indica il salario o altra forma di remunerazione associata al ruolo. In genere, questo si denota usando uno schema di rappresentazione esistente come il `gr:PriceSpecification` ma il codominio è lasciato libero di essere specializzato a seconda delle applicazioni. @it
comment: Salario o cualquier otra remuneración asociada con la actividad. La forma usual de referirse a dicha remuneración será utilizando un esquema de representación como el propuesto en la ontología GoodRelations `gr:PriceSpecification`, pero el rango se deja abierto a que las distintas aplicaciones lo especialicen (por ejemplo, remunerationInGBP) @es
domain: Role
commenet: 役割に関係する給料やその他の報酬を示します。 @ja

Site
type: Class
label: Sede @it
label: sede @es
comment: An office or other premise at which the organization is located. Many organizations are spread across multiple sites and many sites will host multiple locations. In most cases a Site will be a physical location. However, we don't exclude the possibility of non-physical sites such as a virtual office with an associated post box and phone reception service. Extensions may provide subclasses to denote particular types of site.
comment: Un établissement ou tout autre lieu dans lequel une Organisation est localisé. Beaucoup d'organisations sont dispersées à travers plusieurs sites. Dans la plupart des cas un Site sera un lieu physique. Toutefois, nous n'excluons pas la possibilité de sites non-physiques comme un bureau virtuel avec une boîte postale et un service de secrétariat mutualisé. Des extensions pourraient fournir des sous-classes pour décrire des types de sites particuliers. @fr
comment: Un ufficio o altra sede dovei l'organizzazione è situata. Molte organizzazione sono distribuite su più sedi e molte sedi ospitano più ubicazioni. Nella maggior parte dei casi un Site è una locazione fisica. Non si esclude la possibilità di indicare sedi non fisiche come ad esempio gli uffici virtuali. Le estensioni dell'ontologia potrebbero usare delle sottoclassi per rappresentare i tipi particolari di sede. @it
comment: 組織が位置するオフィスやその他の敷地。多くの組織が複数のサイトに散在しており、多くのサイトが多数の場所を持つでしょう。 @ja
comment: Oficina, local o cualquier otro lugar en el que se encuentra una organización. Muchas organizaciones están distribuidas en varias sedes, que a su vez están repartidas en distintas ubicaciones. En muchos casos una sede será un sitio o local físico. Sin embargo, no se excluye la posibilidad de lugares no físicos como oficinas virtuales con los correspondientes apartados de correo y servicio de atención telefónica. Se pueden añadir más subtipos mediante extensiones para incluir tipos especiales de lugares. @es
disjointWith: Change Event

site Address
type: ObjectProperty
type: Property
label: adresse du Site @fr
label: indirizzo della sede @it
label: es la dirección de la sede @es
comment: Indicates an address for the site in a suitable encoding. Use of vCard (using the http://www.w3.org/TR/vcard-rdf/ vocabulary) is encouraged but the range is left open to allow other encodings to be used. The address may include email, telephone, and geo-location information and is not restricted to a physical address.
comment: Indique une adresse pour le site dans un encodage approprié. L'usage du vocabulaire vCard ( http://www.w3.org/TR/vcard-rdf/) est encouragé, mais le range est ouvert pour permettre l'utilisation d'autres vocabulaires. L'adresse peut comporter le courriel, le téléphone, et l'information de géolocalisation; et n'est donc pas seulement limitée à une adresse physique. @fr
comment: Indica un indirizzo per la sede in una codifica appropriata. Il codominio è lasciato libero ma è consigliabile l'uso del vocabolario vCard (http://www.w3.org/TR/vcard-rdf/). L'indirizzo può includere email, numero di telefono e informazioni di geolocalizzazione e non è vincolato ad essere un indirizzo fisico. @it
comment: 適切にコード化されたサイトのアドレスを示します。vCard[vcard-rdf]語彙などの有名なアドレスのコード化の使用が奨励されますが、他の符号化の使用を可能とするために値域はオープンのままにされます。アドレスには、電子メール、電話およびジオロケーション情報を含むことができ、物理的なアドレスに制限されません。 @ja
comment: Dirección de la sede según una codificación adecuada. Se recomienda el uso de vCard (que utiliza el vocabulario en http://www.w3.org/TR/vcard-rdf/), pero el rango no se restringe únicamente al uso de este vocabulario sino que se permite el uso de otros códigos. La dirección puede constar de una dirección de correo electrónico, un número de teléfono o información de geo-localización, y no se limita a una dirección postal física. @es
domain: Site

has site
type: ObjectProperty
type: Property
label: a un site @fr
label: ha sede @it
label: tiene sede en @es
comment: Indicates a site at which the Organization has some presence even if only indirect (e.g. virtual office or a professional service which is acting as the registered address for a company). Inverse of `org:siteOf`.
comment: Indique un site sur lequel l'Organisation possède une présence, même indirecte (domiciliation, boite postale). Inverse de `org:siteOf`. @fr
comment: Indica la sede in cui l'Organization ha una qualche presenza anche in modo indiretto (ad esempio un ufficio virtuale). È l'inverso di `org:siteOf`. @it
comment: 組織が、間接（例えば、会社の登録住所として機能しているバーチャル・オフィスやプロフェッショナル・サービス）のみであったとしても、ある存在感を持っているサイトを示します。 @ja
comment: Lugar en donde la organización tiene algún tipo de presencia, incluso si es de forma indirecta (por ejemplo, una oficina virtual o servicio profesional que hagan la función de dirección registrada de la compañía). Es la relación inversa de `org:siteOf`. @es
domain: Organization
range: Site
inverseOf: site Of

site Of
type: ObjectProperty
type: Property
label: site de @fr
label: sede di @it
label: es sede de @es
comment: Indicates an Organization which has some presence at the given site. This is the inverse of `org:hasSite`.
comment: Indique une Organisation qui a une présence sur le site en question. Inverse de `org:hasSite`. @fr
comment: Indica un'Organization che ha una qualche presenza nella data sede. È l'inverso di `org:hasSite`. @it
comment: あるサイトである存在感を持っている組織を示します。 @ja
comment: Organización que tiene ubicación en un lugar. Es la relación inversa de `org:hasSite`. @es
domain: Site
range: Organization
inverseOf: has site

primary Site
type: ObjectProperty
type: Property
label: site principal @fr
label: sede principale @it
label: tiene sede principal en @es
comment: Indicates a primary site for the Organization, this is the default means by which an Organization can be contacted and is not necessarily the formal headquarters.
comment: Indique le site principal d'une Organisation, le moyen par défaut par lequel l'Organisation peut être contactée et pas nécessairement le siège social légal. @fr
comment: Indica la sede principale per l'Organization. È da considerarsi come la sede di default in cui l'Organization deve essere contattata pur non essendo necessariamente il quartier generale. @it
comment: 組織の主要サイトを示します。組織の窓口となりえるデフォルトの手段ですが、正式な本部とは限りません。 @ja
comment: Oficina principal de la organización, la opción por defecto para ponerse en contacto con una organización, aunque no corresponde necesariamente con las oficinas centrales de la organización. @es
domain: Organization
range: Site
sub property of: has site

registered Site
type: ObjectProperty
type: Property
label: siège social @fr
label: sede legale @it
label: tiene sede registrada en @es
comment: Indicates the legally registered site for the organization, in many legal jurisdictions there is a requirement that FormalOrganizations such as Companies or Charities have such a primary designed site.
comment: Indique l'établissement principal légalement enregistré pour l'Organisation. Dans de nombreuses juridictions existe l'obligation pour une Organisation Formelle d'avoir un tel site principal. @fr
comment: Indica la sede legale per l'Organization. In molte giurisdizioni è richiesto che una FormalOrganization abbia una sede di questo tipo. @it
comment: 組織の法律上登録されたサイトを示し、多くの法的管轄区域では、会社や慈善団体などのFormalOrganizations（正式な組織）がそのような主要サイトを持っているという要件があります。 @ja
comment: Oficina o sede legalmente registrada de la organización. En muchas jurisdicciones legales existe el requisito de que organizaciones formales tales como empresas u organizaciones de beneficencia tengan una sede principal de este tipo. @es
domain: Formal Organization
range: Site
sub property of: primary Site

based At
type: ObjectProperty
type: Property
label: basé à @fr
label: basata a @it
label: trabaja en la sede @es
comment: Indicates the site at which a person is based. We do not restrict the possibility that a person is based at multiple sites.
comment: Indique le site sur lequel une personne est basée. Nous ne limitons pas le nombre de sites sur lesquels une personne peut être basée. @fr
comment: Indica la sede in cui una è stabilita una persona. Non esclude la possibilità che una persona sia allocata su più sedi. @it
comment: 人が基礎としているサイトを示します。人が複数のサイトを基礎としている可能性を制限しません。 @ja
comment: Lugar en el que trabaja una persona. No se restringe el hecho de que una persona pueda estar adscrita a múltiples ubicaciones. @es
domain: Person
range: Site

location
type: ObjectProperty
type: Property
label: localisation @fr
label: luogo @it
label: está ubicado en @es
label: está ubicada en @es
comment: Gives a location description for a person within the organization, for example a _Mail Stop_ for internal posting purposes.
comment: Indique la description de l'endroit ou est basé une personne de l'Organisation, par exemple pour des besoins de messagerie interne (Bureau 42). @fr
comment: Indica la descrizione del luogo presso cui è possibile reperire una persona dell'organizzazione. @it
comment: 例えば、内部配送目的のメール・ストップ（Mail Stop）などの、組織内の人の位置記述を提供します。 @ja
comment: Lugar o ubicación exacta de una persona en una organización con el objetivo de facilitar, por ejemplo, la entrega de correo. @es
domain: Person
range: string

Endeavour
type: Class
label: Partenariat @fr
label: Collaborazione @it
label: proyecto de cooperación empresarial @es
comment: A collaboration between two or more Organizations such as a project. It meets the criteria for being an Organization in that it has an identity and defining purpose independent of its particular members but is neither a formally recognized legal entity nor a sub-unit within some larger organization. Might typically have a shorter lifetime than the Organizations within it, but not necessarily. All members are `org:Organization`s rather than individuals and those Organizations can play particular roles within the venture. Alternative names: _Project_ _Venture_ _Endeavour_ _Consortium_ _Endeavour_
comment: Une collaboration entre deux ou plusieurs Organisations, telle qu'un projet commun. Un partenariat peut être considéré comme Organisation dans le sens ou il possède une identité et un But propre indépendant de ceux de ses membres, mais ce n'est ni une entité légale ni une sous-unité d'une Organisation plus grande. Typiquement, elle peut avoir une durée de vie plus courte que les Organisations qui la composent, mais pas nécessairement. Tous les membres sont des `org:Organization`s plutôt que des individus et ces Organisations peuvent jouer des Rôles particuliers au sein du Partenariat. @fr
comment: È una collaborazione tra due o più Organization come ad esempio un progetto. Consente di rappresentare alcune identità dell'Organization che sono fuori dallo scopo principale e non sono formalmente riconosciute. Potrebbe anche avere un ciclo di vita limitato. @it
comment: プロジェクトなどの2つ以上の組織間のコラボレーション。それは、アイデンティティを有し、その特定のメンバーとは無関係に目的を定めているという点で、組織としての基準を満たしますが、正式に認識された法的実体でも、あるより大きな組織内のサブユニットでもありません。一般的には、その内部の組織よりも存続期間が短いかもしれませんが、必ずしもそうとは限りません。 @ja
comment: Colaboración determinada entre dos o más organizaciones, como en el caso de un proyecto común. Cumple con los criterios de ser una organización en sí misma, en la medida en que tiene una identidad y un propósito definido independiente de sus miembros en particular, pero no es una entidad legal formalmente reconocida ni una sub-unidad dentro de una organización más grande. La duración suele ser más corta que la de las organizaciones que lo componen, pero no necesariamente. Todos sus miembros son de tipo `org:Organization` en vez de individuos, y desempeñan una actividad concreta en el marco del proyecto de cooperación. @es
subclass of: Organization
equivalentClass: Class
  intersectionOf: Organization
  intersectionOf: Restriction
    allValuesFrom: Organization
    onProperty: has member
equivalentClass: Class
  intersectionOf: Organization
  intersectionOf: Restriction
    allValuesFrom: Organization
    onProperty: has member

Restriction
type: Class
comment: The class of property restrictions.
subclass of: Class

allValuesFrom
type: Property
comment: The property that determines the class that a universal property restriction refers to.
domain: Restriction
range: Class

onProperty
type: Property
comment: The property that determines the property that a property restriction refers to.
domain: Restriction
range: Property

intersectionOf
type: Property
comment: The property that determines the collection of classes or data ranges that build an intersection.
domain: Class
range: List

Change Event
type: Class
label: Évènement @fr
label: Evento di cambiamento @it
label: evento de cambio @es
comment: Represents an event which resulted in a major change to an organization such as a merger or complete restructuring. It is intended for situations where the resulting organization is sufficient distinct from the original organizations that it has a distinct identity and distinct URI. Extension vocabularies should define sub-classes of this to denote particular categories of event. The instant or interval at which the event occurred should be given by `prov:startAtTime` and `prov:endedAtTime`, a description should be given by `dct:description`.
comment: Représente un Évènement impliquant un changement majeur dans l'Organisation, comme une fusion ou une restructuration. Prévu pour des situations ou l'organisation finale est suffisamment différente des Organisations originales pour qu'elle ait une identité et une URI distinctes. Des vocabulaires d'extension devraient définir des sous-classes de celle-ci pour annoter les différentes catégories d'Évènemenents. Le moment ou l'intervalle de l'Évènement devrait être indiqué avec `prov:startAtTime` et `prov:endedAtTime`, et une description avec la classe `dct:description`. @fr
comment: Rappresenta un evento risultato essere un importante cambiamento per un'organizzazione come ad esempio una fusione o una riorganizzazione. È pensato per quelle situazioni in cui l'organizzazione risultante si distingue da quella originale sufficientemente da essere rappresentata con una URI differente. Le estensioni del vocabolario dovrebbero definire le sotto-classi per esprimere particolari categorie di eventi. L'istante o l'intervallo in cui l'evento accade dovrebbe essere espresso tramite `prov:startAtTime` e`prov:endedAtTime`. Una descrizione dovrebbe essere fornita attraverso `dct:description`. @it
comment: 合併や完全な再編などの組織に大きな変化をもたらした出来事を表わします。これは、結果として作成される組織と元の組織とが、別のアイデンティティーと別のURIを持つに足るほど異なる状況を対象としています。 @ja
comment: Evento que da como resultado un cambio sustancial en la organización, por ejemplo, una fusión o una reestructuración total. Está pensado para situaciones en las que la organización resultante es lo suficientemente distinta de las organizaciones originales, tiene una identidad distinta y una URI también distinta. Se deberían definir subtipos de eventos mediante vocabularios específicos (Extension vocabularies) para referirse a categorías de eventos específicos. El momento o periodo en el que el evento ocurre se debería expresar mediante las propiedades `prov:startAtTime` y `prov:endedAtTime`, y una descripción del mismo se debería incluir mediante el uso de la propiedad `dct:description`. @es
subclass of: Activity

original organization
type: ObjectProperty
type: Property
label: organisation originelle @fr
label: organizzazione originale @it
label: es organización original @es
comment: Indicates one or more organizations that existed before the change event. Depending on the event they may or may not have continued to exist after the event. Inverse of `org:changedBy`.
comment: Indique une ou plusieurs organisations qui ont existé avant un évènement de changement. Selon l'évènement, ces organisations ont pu continuer à exister ou non. Inverse de `org:changedBy`. @fr
comment: Indica una o più organizzazioni pregresse rispetto a un evento di cambiamento. A seconda dell'evento, queste organizzazioni potrebbero essere esistenti dopo l'evento o aver cessato la loro esistenza. È l'inverso di `org:changedBy`. @it
comment: 変更のきっかけとなった出来事以前に存在した1つ以上の組織を示します。出来事によって、出来事の後にそれらは存在し続けたかも、存在し続けなかったかもしれません。 @ja
comment: Una o más organizaciones que existían antes de que sucediera el cambio en la organización. Dependiendo del tipo de cambio, dichas organizaciones pueden haber dejado de existir o no. Es la relación inversa de `org:changedBy`. @es
domain: Change Event
range: Organization
inverseOf: changed by
sub property of: used

changed by
type: ObjectProperty
type: Property
label: modifiée par @fr
label: cambiata da @it
label: es modificada por @es
label: es modificado por @es
comment: Indicates a change event which resulted in a change to this organization. Depending on the event the organization may or may not have continued to exist after the event. Inverse of `org:originalOrganization`.
comment: Indique un évènement qui a impliqué un changement dans l'Organisation. Selon l'évènement, l'Organisation a continué à exister après l'évènement, ou pas. Inverse de `org:originalOrganization`. @fr
comment: Indica un evento che ha contribuito al cambiamento di questa organizzazione. A seconda dell'evento, l'organizzazione potrebbe essere esistente dopo l'evento o aver cessato la propria esistenza. È l'inverso di `org:originalOrganization`. @it
comment: この組織の変更のきっかけとなった出来事を示します。 @ja
comment: Evento de cambio que resulta en una modificación en la organización. Dependiendo del evento, la organización puede dejar de existir tras el cambio. Es la relación inversa de `org:originalOrganization`. @es
domain: Organization
range: Change Event
inverseOf: original organization

resulted from
type: ObjectProperty
type: Property
label: issue de @fr
label: risultato da @it
label: es el resultado de @es
comment: Indicates an event which resulted in this organization. Inverse of `org:resultingOrganization`.
comment: Indique un évènement dont est issue l'Organisation. Inverse de `org:resultingOrganization`. @fr
comment: Indica l'evento che ha permesso all'organizzazione di instaurarsi. È l'inverso di `org:resultingOrganization`. @it
comment: この組織になった（導いた、作成された）きっかけとなった出来事を示します。 @ja
comment: Evento que tiene como resultado la creación de una organización. @es
domain: Organization
range: Change Event
inverseOf: resulted in
sub property of: wasGeneratedBy

resulted in
type: ObjectProperty
type: Property
label: a donné naissance à @fr
label: risultato in @it
label: resulta en @es
comment: Indicates an organization which was created or changed as a result of the event. Inverse of `org:resultedFrom`.
comment: Indique une organisation qui a été créée ou a été modifiée à la suite d'un Évènement de changement. Inverse de `org:resultedFrom`. @fr
comment: Indica l'organizzazione che è stata creata o mutata a seguito dell'evento. È l'inverso di `org:resultedFrom`. @it
comment: 出来事の結果、作成、変更された組織を示します。 @ja
comment: Organización que ha sido creada o modificada tras un evento específico. Es la relación inversa de `org:resultedFrom`. @es
domain: Change Event
range: Organization
inverseOf: resulted from

propertyChainAxiom
type: Property
comment: The property that determines the n-tuple of properties that build a sub property chain of a given property.
domain: ObjectProperty
range: List

holds
type: ObjectProperty
type: Property
label: occupe @fr
label: ricopre @it
label: ocupa @es
comment: Indicates a Post held by some Agent.
comment: Indicate un Poste occupé par un Agent. @fr
comment: Indica un Impiego ricoperto da un Agent. @it
comment: あるエージェントによって保持されているポストを示します。 @ja
comment: Puesto ocupado por algún agente. @es
domain: Agent
range: Post
inverseOf: held by

held by
type: ObjectProperty
type: Property
label: occupé par @fr
label: ricoperto da @it
label: ocupado por @es
comment: Indicates an Agent which holds a Post.
comment: Indicate un Agent qui occupe le Poste. @fr
comment: Indica un Agent che ricopre un Post. @it
comment: ポストを保持するエージェントを示します。 @ja
comment: Agente que ocupa un puesto. @es
domain: Post
range: Agent

post in
type: ObjectProperty
type: Property
label: poste chez @fr
label: impiego in @it
label: es un puesto en @es
comment: Indicates the Organization in which the Post exists.
comment: Indicate l'Organisation dans laquelle le Poste existe. @fr
comment: Indica l'Organization in cui il Post è presente. @it
comment: ポストが存在する組織を示します。 @ja
comment: Organización en la que existe el puesto. @es
domain: Post
range: Organization
inverseOf: post

post
type: ObjectProperty
type: Property
label: possède un poste @fr
label: impiego @it
label: tiene puesto @es
comment: Indicates a Post which exists within the Organization.
comment: Indicate un Poste qui existe dans l'Organisation. @fr
comment: Indica il Post che è presente in una Organization. @it
comment: 組織内に存在するポストを示します。 @ja
comment: Posición que existe en una organización. @es
domain: Organization
range: Post

SCoRO, the Scholarly Contributions and Roles Ontology
type: Ontology
creator: David Shotton
imports: pro
comment: SCoRO is written in OWL 2 DL, and imports FOAF, the Friend of a Friend Ontology (http://xmlns.com/foaf/spec/) and PRO the Publishing Roles Ontology (http://purl.org/spar/pro/). This ontology is available at http://purl.org/spar/scoro/, and uses the namespace prefix 'scoro'. It is designed to be used in conjunction with FRAPO, the Funding, Research Administration and Projects Ontology (http://purl.org/spar/frapo/), and with FaBiO, the FRBR-aligned Bibliographic Ontology (http://purl.org/spar/fabio/). A Web-based scholarly contributions report form based on this ontology, for use in creating metadata to describe authorship roles and scholarly contributions to journal articles and their underlying research, is available from http://purl.org/spar/scoro/**** (to be created). Alternatively, an Excel Scholarly Contributions Report Form based on this ontology, created using RightField (http://www.sysmo-db.org/rightfield) also for use in creating metadata to describe authorship roles and scholarly contributions to journal articles and their underlying research, is available from http://purl.org/spar/scoro/SCoRF.xls.
Contributor: Silvio Peroni
date: 2014-05-21
description: SCoRO, the Scholarly Contributions and Roles Ontology, is an ontology for use by authors and publishers for describing the contributions that may be made and the roles that may be held by a person with respect to a journal article or other publication, and by research administrators for describing contributions and roles with respect to other aspects of scholarly research. In this ontology, the object properties (e.g. scoro:makesContribution) and the individuals within classes (e.g. scoro:conducts-experiments) are expressed in the present tense, as is conventional for ontologies, but should be taken as potentially referring to past, present or future roles and contributions.
description: Since roles have contexts and times that are important to take into account (for example, a person can be author of one paper and reviewer of another, while another person will be editor of a journal only for a defined period, not for ever), the SCORO ontology permit these contexts to be specified, using an ontological design pattern called the time-indexed value in context (TVC) (http://www.essepuntato.it/2012/04/tvc/) which is part of the PRO ontology (http://purl.org/spar/pro/) imported by SCORO. This ontology design pattern permits one to construct the following RDF statements: foaf:Agent pro:holdsRoleInTime [ a pro:RoleInTime pro:withRole pro:editor ] . Thus the domain of pro:withRole is not foaf:Agent, but rather an anonymous member of the class pro:RoleInTime, which itself is the range of the property pro:holdsRoleInTime, for which the domain is foaf:Agent. The range of pro:withRole is the class pro:Role, and its sub-classes pro:PublishingRole, scoro:InvestigationalRole, scoro:OrganizationalRole, etc., whose members permit specific roles to be specified. This single step of indirection permits other contextual and temporal attributes (not shown here) to be specified for this member of the class pro:RoleInTime, putting that role into context. Exemplar usage: fabio:Dataset dcterms:contributor [ rdf:type foaf:Organization ; foaf:name "Met Office" ; foaf:homepage <http://www.metoffice.gov.uk/> ; pro:holdsRoleInTime [ a pro:RoleInTime pro:withRole scoro:data-creator ] ] . Exactly the same use of TVC and of individuals within the class scoro:Contribution and its sub-classes is used for scoro:withContribution, enabling contributions to be time-limited and given contexts.
versionInfo: 1.8.2.1
Rights: This work is distributed under a Creative Commons Attribution License (http://creativecommons.org/licenses/by/3.0/).

Rights
type: AnnotationProperty
type: Property
modified: 2008-01-14
has version: rights-006
comment: Information about rights held in and over the resource.
description: Typically, rights information includes a statement about various property rights associated with the resource, including intellectual property rights.
issued: 1999-07-02
note: A second property with the same name as this property has been declared in the dcterms: namespace (http://purl.org/dc/terms/). See the Introduction to the document "DCMI Metadata Terms" (http://dublincore.org/documents/dcmi-terms/) for an explanation.

percentage full-time equivalent
type: DatatypeProperty
type: AnnotationProperty
comment: A data property permitting specification of the proportion of a person's full time activity that is dedicated to a particular role (e.g. for part-time employment, 50% FTE).
domain: RoleInTime

with job title
type: DatatypeProperty
type: AnnotationProperty
comment: A data property connecting an agent's role in time to a job title that characterizes that role. This data property complements the definition of that role in time specified by scoro:Role. For example, for the scoro:OrganizationalRole 'Head of Department', the specific Job Title might be 'Linacre Professor of Zoology' or 'Regius Professor of Moral Philosophy'.
domain: RoleInTime

has contribution context
type: ObjectProperty
comment: A property relating a contribution situation to an entity representing the context for that situation.
domain: contribution situation
sub property of: withinContext

contribution situation
type: Class
comment: The situation an agent has of making a contribution to realizing a goal or completing a task relating to a scholarly activity or entity such as journal article. The type or nature of the contribution is defined by the object of the object property scoro:withContribution, which is an individual in the class scoro:Contribution or one of its sub-classes. The entity to which the contribution relates is specified using the object property scoro:relatesToEntity or one of its sub-properties, and the effort expended in making that contribution is specified using the object property scoro:withContributionEffort.
subclass of: ValueInTime
subclass of: Restriction
  onProperty: with contribution
  someValuesFrom: contribution
subclass of: Restriction
  onProperty: with contribution
  someValuesFrom: contribution
description: A contribution situation describes always: - a particular contribution C - a particular agent A making contribution C - a particular time interval T in which A makes C (optional) - a particular contribution effort E - one or more entities (e.g. an investigation or data) that defines a context for C contributed by A. (At least one contextual entity should be specified for a particular contribution).

is contribution in
type: ObjectProperty
comment: The property relating the definition of a specific contribution to the contribution situation of an agent making that contribution.
domain: contribution
range: contribution situation
inverseOf: with contribution
sub property of: hasTimeIndexedSetting

contribution
type: Class
comment: Defines the type or nature of a contribution made by an agent. Individual members of this class or its sub-classes are used to specify particular contributions.
subclass of: Thing
disjointWith: contribution effort

with contribution
type: ObjectProperty
type: FunctionalProperty
comment: An object property connecting an agent's contribution situation to a definition of the contribution made by this agent, specified as an instance of the class scoro:Contribution or of one of its sub-classes.
domain: contribution situation
range: contribution
sub property of: withValue

is equal to contribution situation
type: ObjectProperty
type: TransitiveProperty
type: SymmetricProperty
comment: This property allows the link of two contribution situations that are equals for particular aspects (i.e. for type of contribution, contribution effort and context).
domain: contribution situation
range: contribution situation

SymmetricProperty
type: Class
comment: The class of symmetric properties.
subclass of: ObjectProperty

is equal to role in time
type: ObjectProperty
comment: This property allows the link of two roles in time as being equal, and is particularly useful for specifying that two principal authorship roles are equal.
domain: RoleInTime
range: RoleInTime

is made by
type: ObjectProperty
comment: A property relating a contribution situation that an agent makes, to that agent.
domain: contribution situation
range: Agent
inverseOf: makes contribution
sub property of: forEntity

makes contribution
type: ObjectProperty
comment: An object property linking an agent to a contribution. This is done via the indirection: foaf:Agent scoro:makesContribution [ a scoro:ContributionSituation ; scoro:withContribution scoro:Contribution ; scoro:withEffort scoro:ContributionEffort ] . The ontology permits one to specify the time period over which a contribution is made, and the other contextual entities to which that agent's contribution relates.
domain: Agent
range: contribution situation
sub property of: hasValue

is related to contribution situation
type: ObjectProperty
comment: A property relating an entity to the contribution situation for which that entity provides the context.
range: contribution situation
inverseOf: has contribution context
sub property of: hasTimeIndexedSetting

with contribution effort
type: ObjectProperty
comment: An object property connecting an agent's contribution with respect to a particular entity to the amount of effort exerted by this agent in making that contribution, defined by individuals of the class scoro:ContributionEffort.
domain: contribution situation
range: contribution effort
sub property of: forEntity

contribution effort
type: Class
comment: Defines the effort expended in making a contribution.
subclass of: Thing

has ORCID
type: DatatypeProperty
comment: A data property relating an individual to his/her Open Researcher and Contributor ID (ORCID), an alphanumeric identifier for individual scholars described at http://about.orcid.org/.
domain: Person
description: owl:equivalentProperty <http://purl.org/spar/frapo/hasORCID> .
sub property of: has personal identifier

has personal identifier
type: DatatypeProperty
comment: A data property specifying a unique and unambiguous identifier for an individual person within a given context, specified by the object property scoro:usesPersonalIdentifierScheme and an individual member of the class scoro:PersonalIdentifierScheme.
domain: Person
description: owl:equivalentProperty <http://purl.org/spar/datacite/hasPersonalIdentifier> .
description: owl:equivalentProperty <http://purl.org/spar/frapo/hasPersonalIdentifier> .

authorship contribution
type: Class
comment: Defines the type or nature of a contribution made with respect to the authorship of a publication such as a journal article. Individual members of this class are used to specify particular authorship contributions.
subclass of: contribution

authorship role
type: Class
comment: A role that a person might hold as an author of a publication or the creator of a work. Individual members of this class are used to specify particular roles.
subclass of: Role

computational agent
type: Class
comment: A computer system or software program whose action has an effect on external events, for example a laboratory robot that undertakes your experiments, or the financial control system that controls an institution's payrole, or that, following programmed business rules, prevents the principal investigator from placing an order for research equipment because there is insufficient money left in the project budget.
subclass of: Agent

someValuesFrom
type: Property
comment: The property that determines the class that an existential property restriction refers to.
domain: Restriction
range: Class

data role
type: Class
comment: A role that an agent might hold with respect to data. Individual members of this class are used to specify particular roles.
subclass of: Role

educational role
type: Class
comment: A role that an agent might hold with respect to an educational organization or activity. Individual members of this class are used to specify particular educational roles.
subclass of: Role

experimental contribution
type: Class
comment: Defines the type or nature of a practical or experimental contribution made to the research. Individual members of this class are used to specify particular contributions.
subclass of: contribution

financial role
type: Class
comment: A role that an agent might hold with respect to academic and project finance. Individual members of this class are used to specify particular roles.
subclass of: Role

intellectual contribution
type: Class
comment: Defines the type or nature of an intellectual contribution made to the research described in a journal article. Individual members of this class are used to specify particular contributions.
subclass of: contribution

investigation role
type: Class
comment: A role that an agent might hold with respect to an investigation. Individual members of this class are used to specify particular roles.
subclass of: Role

organizational contribution
type: Class
comment: Defines the type or nature of an organizational or administrative contribution. Individual members of this class are used to specify particular contributions.
subclass of: contribution

organizational role
type: Class
comment: A role that an agent might hold with respect to an organization and its administration, particularly within an academic context. Individual members of this class are used to specify particular roles.
subclass of: Role

project role
type: Class
comment: A role that an agent might hold with respect to a project. Individual members of this class are used to specify particular roles.
subclass of: Role

NamedIndividual
type: Class
comment: The class of named individuals.
subclass of: Thing

access provider
type: data role
type: NamedIndividual
comment: The role of an agent who provides access to a resource, for example an online data repository.

accountant
type: financial role
type: NamedIndividual
comment: The role held by a person whose job is to manage financial accounts, for example the accounts of an organization, or of a particular funded project or activity of that organization.

administrator
type: organizational role
type: NamedIndividual
comment: The role held by an agent responsible for the day-to-day management and running of an organization or activity.

affiliate
type: organizational role
type: NamedIndividual
comment: The role an agent has of being affiliated to some organization or institution in a context of some entity or activity, for example a document, a project or an internship.
description: The affiliation of a person to an organization or institution can be specified by using the property pro:relatesToEntity, as shown in the following example: foaf:Person scoro:holdsOrganizationalRole [ pro:withRole pro:affiliate ; pro:relatesToEntity _:aff ] . _:aff a foaf:Organization ; vcard:extended-address 'Department of Zoology, University of Oxford, United Kingdom' .

agent
type: organizational role
type: NamedIndividual
comment: An agent that acts on behalf of another agent.

analyses data
type: intellectual contribution
type: NamedIndividual
comment: The contribution of data analysis. This might include statistical analysis, bioinformatics analysis, or image analysis.

approves final manuscript
type: authorship contribution
type: NamedIndividual
comment: The contribution of approving the final version of the manuscript, prior to submission for publication.

article guarantor
type: authorship role
type: NamedIndividual
comment: The role of a person who takes responsibility for the integrity of the work as a whole, from the inception of the research investigation to the published research article.

auditor
type: financial role
type: NamedIndividual
comment: The role held by a person who conducts a formal audit of financial accounts.

builds and/or maintains instruments
type: experimental contribution
type: NamedIndividual
comment: The contribution of building instruments, equipment or scientific apparatus and/or maintaining the same in a workable condition for use in experiments.

CEO
type: organizational role
type: NamedIndividual
label: chief executive officer
comment: The role held by a person who is the chief executive officer of an organization, responsible for directing and managing the business of that organization.

chief scientist
type: investigation role
type: NamedIndividual
comment: A senior scientist who takes a leadership role in an organization or group.

CTO
type: organizational role
type: NamedIndividual
label: chief technology officer
comment: The role held by a person who is the chief technology officer of an organization, responsible for directing and managing technical developments for that organization.

claimant
type: financial role
type: NamedIndividual
comment: The role held by a person making a financial claim, for example for refund of travel expenses from a project grant.

co-applicant
type: project role
type: NamedIndividual
comment: The role a person has of being a co-applicant on the grant application to obtain funding to fund an endeavour such as a research project.

co-investigator
type: investigation role
type: NamedIndividual
comment: The role a person has of being a co-investigator for a research investigation.

collaborator
type: investigation role
type: NamedIndividual
comment: The role a person, typically from another research group or institution, who collaborates with the team undertaking a research investigation.

collects data
type: experimental contribution
type: NamedIndividual
comment: The contribution of making experimental observations and collecting data, for example using a telescope, a microscope or an analytical instrument.

college fellow
type: organizational role
type: NamedIndividual
comment: The role held by an academic as a senior member of a college.

college head
type: organizational role
type: NamedIndividual
comment: The role held by a senior academic who heads a college and acts as its CEO. Among the many alternative titles give to this role, the most common are President or Master of the college.

computer programmer
type: investigation role
type: NamedIndividual
comment: The role a person has of being someone who develops computer software.

conceives project
type: intellectual contribution
type: NamedIndividual
comment: The contribution of conceiving the research project in the first place. Note that an individual other than the lead applicant and the co-applicants on a grant application may make considerable contributions to conceiving a research project, but may be prevented from being a formal applicant by reason of affiliation or status (e.g. as a non-academic partner, or a research student).

consortium author
type: authorship role
type: NamedIndividual
comment: The authorship role of an organisation or consortium that has contributed collectively to the work described in the publication and is named in the list of authors, e.g. 'Wellcome Trust Case Control Consortium' or 'Malaria Genomic Epidemiology Network'. (The members of such a group should be separately listed elsewhere in the document).

consultant
type: investigation role
type: NamedIndividual
comment: The role a person has of being a consultant who is providing expertise or services.

contact person
type: organizational role
type: NamedIndividual
comment: The role of a person who serves as the primary contact and information provider for third parties wishing to find out more about an organization or an activity.

contractor
type: financial role
type: NamedIndividual
comment: The role held by an agent who enters into a contract to undertake specified work or to supply specified services in return for payment.

controls project finances
type: organizational contribution
type: NamedIndividual
comment: The contribution of controlling the financial aspects of the research project, including authorizing expenditure, creating and managing budgets, and submitting financial reports to the funding agency.

corresponding author
type: authorship role
type: NamedIndividual
comment: The role an author has of being the corresponding author of the document, with whom editors and readers should correspond concerning it.

creates novel organisms or cells
type: experimental contribution
type: NamedIndividual
comment: The contribution of creating novel organisms (e.g. mouse mutants) or cells (e.g. tranformed cell lines), either for use in the research, or as a research output of use to others.

creates novel reagents
type: experimental contribution
type: NamedIndividual
comment: The contribution of creating novel physical or chemical compounds, or molecular biology constructs, either for use in the research, or as a research output of use to others.

creates software
type: experimental contribution
type: NamedIndividual
comment: The contribution of creating computer software, including software for experimental control, analytical tools, mathematical model and computational simulations for use in the research, or of creating an IT service (e.g. a bioinformatics database or Web service) of use to others.

curator
type: data role
type: NamedIndividual
comment: The role of an agent that documents, cares for and manages collections of objects (for example in a museum) or of data (as in a data repository or database). [A data curator is a curator who specializes in digital data, while a librarian is a type of curator specializing in textual publications.]

data creator
type: data role
type: NamedIndividual
comment: The role a person has of being a creator or originator of new data.

data curator
type: data role
type: NamedIndividual
comment: The role a person has of being a data curator, responsible for long-term preservation of data, for example those arising from the research project.

data manager
type: data role
type: NamedIndividual
comment: The role a person has of being a data manager, responsible for day-to-day management and back-up of data, for example those arising from the research project.

data publisher
type: data role
type: NamedIndividual
comment: The role of an agent who publishes data.

data user
type: data role
type: NamedIndividual
comment: The role a person has of being a user or re-user of existing data.

departmental administrator
type: organizational role
type: NamedIndividual
comment: The role held by a person who is the administrator of a department within a larger organization, for example of a university academic department.

designs experiments
type: intellectual contribution
type: NamedIndividual
comment: The contribution of experimental design and planning.

develops methodology
type: experimental contribution
type: NamedIndividual
comment: The contribution of developing experimental methodology that enables research.

director
type: organizational role
type: NamedIndividual
comment: The role held by a person who is in charge of an organization or activity, for example a research institute or a dramatic performance.

embargo controller
type: data role
type: NamedIndividual
comment: The role of the person who has responsibility for setting and lifting embargos that restrict access to a dataset (or a document) for a specified period of time.

employee
type: organizational role
type: NamedIndividual
comment: The role held by a person employed for wages or a salary by an organization, to undertake work for that organization.

employer
type: organizational role
type: NamedIndividual
comment: The role held by an agent that employs one or more people to undertake work on that agent's behalf.

ensures regulatory compliance
type: organizational contribution
type: NamedIndividual
comment: The contribution of ensuring regulatory compliance for the research undertaken, for example in obtaining informed consent from patients, approval from research ethics or radiation safety committees, or a license for animal experimentation.

faculty member
type: educational role
type: NamedIndividual
comment: The role of an academic employed to undertake research and teaching within a university department, school or institute.

financial controller
type: financial role
type: NamedIndividual
comment: The role held by an agent of controlling the finances, for example the finances of an organization, a building project or a research project. This role extends to the control of or the authorisation of expenditure from a budget, and may be undertaken by a computational agent.

formulates research questions
type: intellectual contribution
type: NamedIndividual
comment: The contribution of formulating the questions to be answered and the hypotheses to be tested by the research to be undertaken.

funder
type: financial role
type: NamedIndividual
comment: The role held by an agent of providing funds, for example for a research project.

funding recipient
type: financial role
type: NamedIndividual
comment: The role held by an agent who is the official recipient of funding, for example the university of which a funded research project leader is a member.

head of department
type: organizational role
type: NamedIndividual
comment: The role held by a person who is the chief executive officer of a department within a larger organization, for example a senior academic who is head of a university academic department.

illustrator
type: authorship role
type: NamedIndividual
comment: The role a person has of being an illustrator of, or for, some entity.

interprets results
type: intellectual contribution
type: NamedIndividual
comment: The contribution of interpretation of experimental results.

inventor
type: investigation role
type: NamedIndividual
comment: The role a person has of being the inventor or some entity (for example a computer algorithm, or an experimental procedure).

lead applicant
type: project role
type: NamedIndividual
comment: The role a person has of being the lead applicant on the grant application to obtain funding to fund an endeavour such as a research project.

leads investigation
type: intellectual contribution
type: NamedIndividual
comment: The contribution of providing intellectual leadership and direction for the research. Note that an individual other than the principal investigator and the co-investigators may make considerable leadership contributions to a research investigation.

maintains IT infrastructure
type: experimental contribution
type: NamedIndividual
comment: The contribution of maintaining the IT infrastructure required for the research.

maintains organisms or cell cultures
type: experimental contribution
type: NamedIndividual
comment: The contribution of maintaining multicellular organisms (plants, animals or fungi) or cell cultures used as experimental subjects, and of breeding these where appropriate. [Note that there may be occasions when it is inappropriate to acknowledge such contributions, for fear of personal reprisals on the individuals involved from animal rights activists].

maintains research facility
type: experimental contribution
type: NamedIndividual
comment: The contribution of managing and operating a research facility, for example a confocal microscopy facility.

contributed major effort
type: contribution effort
type: NamedIndividual
comment: The contributor provided a major effort towards achieving this contribution. (It would be unusual for more than three contributors to be described as providing major effort towards achieving any particular contribution).

manager
type: organizational role
type: NamedIndividual
comment: The role held by a person responsible for managing the day-to-day activities of an activity, enterprise or organization.

manages project
type: organizational contribution
type: NamedIndividual
comment: The contribution of project management. Note that an individual other than the person holding the formal role of project manager may make considerable contributions to the management of a research project.

member
type: organizational role
type: NamedIndividual
comment: The role held by an agent of belonging to a group or organization.

contributed minor effort
type: contribution effort
type: NamedIndividual
comment: The contributor provided a minor effort towards achieving this contribution.

non-academic staff member
type: organizational role
type: NamedIndividual
comment: The role of a person employed within a university department, school or institute who is not a member of the academic faculty.

obtains and/or prepared specimens
type: experimental contribution
type: NamedIndividual
comment: The contribution of obtaining and/or preparing specimens in a manner requiring research expertise or skill, for example collecting and preparing fossils, or preparing electron microscope specimens for examination.

organizer
type: organizational role
type: NamedIndividual
comment: The role held by an agent who organizes something, such as a conference, a private meeting or a public event.

owner
type: financial role
type: NamedIndividual
comment: The role held by an agent who is the owner of something with actual or potential financial value, for example a building, a piece of equipment, the copyright of a document, or the intellectual property rights relating to an idea or discovery.

participant
type: organizational role
type: NamedIndividual
comment: The role held by an agent who takes part in something, for example a conference, a private meeting or a public event.

partner
type: organizational role
type: NamedIndividual
comment: The role held by a person who is a partner with one or more other people in an organization, project, endeavour, activity or sphere of common interest.

patent holder
type: organizational role
type: NamedIndividual
comment: The role held by an agent who holds a patent. [See also http://purl.org/spar/scoro/rights-holder and http://purl.org/spar/pro/copyright-owner].

performs experiments
type: experimental contribution
type: NamedIndividual
comment: The contribution of performing experiments.

photographer
type: authorship role
type: NamedIndividual
comment: The role a person has of being a photographer of, or for, some entity.

possessor
type: organizational role
type: NamedIndividual
comment: The role held by an agent as possessor or owner of some entity such as an address or a telephone number.

postdoctoral researcher
type: investigation role
type: NamedIndividual
comment: The role a person has of being a post-doctoral researcher involved in a research investigation.

postgraduate student
type: educational role
type: NamedIndividual
comment: The role of a person registerd for a graduate (masters or doctoral) degree at a university.

prepares illustrations
type: authorship contribution
type: NamedIndividual
comment: The contribution of selecting the data and preparing the figures and tables presenting these data for inclusion in the publication.

prepares supplementary information
type: authorship contribution
type: NamedIndividual
comment: The contribution of preparing the supplementary information files submitted with the manuscript.

principal author
type: authorship role
type: NamedIndividual
comment: The role an author has of being the principal or primary author of the document, who has contributed most to the work described. (In some communities, but not all, the principal author is named first in the author list. Two or more authors can have the role of principal author if they contributed equally to the work. This role should not be employed in communities in which no primacy of authorship is asserted, but where all authors are deemed to have made an equal contribution to the work.)

principal investigator
type: investigation role
type: NamedIndividual
comment: The role a person has of being the principal investigator for a research investigation.

processs data
type: experimental contribution
type: NamedIndividual
comment: The contribution of processing, cleaning, assembling, condensing or refining the data.

programme manager
type: organizational role
type: NamedIndividual
comment: The role held by a person who is in charge of a programme of related activities or projects, for example on behalf of a funding agency.

project leader
type: project role
type: NamedIndividual
comment: The role a person or an institution has of being project leader for a project such as a research project.

project manager
type: project role
type: NamedIndividual
comment: The role a person has of being project manager for a project such as a research project.

project member
type: project role
type: NamedIndividual
comment: The role a person has of being a member of a project such as a research project.

project student
type: investigation role
type: NamedIndividual
comment: The role a person has of being a project student, namely someone engaged in an undergraduate research project as part of studying for an undergraduate degree at a university, whose research will be presented in an undergraduate research project report in part fulfilment of the requirements of that degree.

provides administrative support
type: organizational contribution
type: NamedIndividual
comment: The contribution of providing administrative support for the research project.

provides advice
type: intellectual contribution
type: NamedIndividual
comment: The contribution of providing advice to facilitate the research, while not actively participating in the work.

provides existing data
type: experimental contribution
type: NamedIndividual
comment: The contribution of providing pre-existing data for re-use in the research.

provides patients
type: experimental contribution
type: NamedIndividual
comment: The contribution of providing access to medical or veterinary patients, to make possible the research.

provides reagents, specimens or materials
type: experimental contribution
type: NamedIndividual
comment: The contribution of providing reagents, specimens or materials, including living organisms and cells, for example those not readily obtainable from commercial sources, to make possible the research.

provided service
type: experimental contribution
type: NamedIndividual
comment: The contribution of providing a research service, for example a DNA sequencing service or a custom peptide synthesis service.

provides software
type: experimental contribution
type: NamedIndividual
comment: The contribution of providing software to facilitate the research, while not actively participating in the work.

provides technical support
type: experimental contribution
type: NamedIndividual
comment: The contribution of providing technical support that facilitates research.

provides tools, equipment or facilities
type: experimental contribution
type: NamedIndividual
comment: The contribution of providing tools, equipment or facilities for the research, while not actively participating in the work.

publishes data
type: authorship contribution
type: NamedIndividual
comment: The contribution of publishing in a public database or data repository data arising from the research. Note that this activity is distinct from that of publishing a journal article containing a selection of these data.

purchaser
type: financial role
type: NamedIndividual
comment: The role held by an agent of making purchases of goods or services, the cost of which is typically charged to a particular academic budget, for example a project manager placing an order to purchase equipment funded from a research grant.

registrar
type: organizational role
type: NamedIndividual
comment: The role held by an agent responsible for maintaining official records, for example the records of student enrollment and academic standing held by a college or university, or the records of securities owned by a financial institution.

repository manager
type: data role
type: NamedIndividual
comment: The role a person has of being a manager of a repository where entities are given secure long-term storage, typically digital repository for information objects, for example a data repository.

research assistant
type: investigation role
type: NamedIndividual
comment: The role a person has of being a research assistant involved in a research investigation.

research student
type: investigation role
type: NamedIndividual
comment: The role a person has of being a research student, namely someone engaged in research as part of studying for a higher degree at a university or research institute, whose research will be presented in a thesis in part fulfilment of the requirements of that degree.

researcher
type: investigation role
type: NamedIndividual
comment: The role a person has of being a researcher involved in a research investigation.

revises manuscript
type: authorship contribution
type: NamedIndividual
comment: The contribution of critically reviewing and revising drafts of the manuscript of the research paper.

rights holder
type: organizational role
type: NamedIndividual
comment: The role held by an agent who holds the legal rights to a project or activity and its products and outcomes, for example the exploitation, licensing and intellectual property rights. [See also http://purl.org/spar/scoro/patent-holder and http://purl.org/spar/pro/copyright-owner].

scholar
type: investigation role
type: NamedIndividual
comment: The role of an academic who undertakes scholarly activities, including research investigations. This role is particularly used to describe endeavours in the arts and humanites that are frequently undertaken without financial support from a particular funded project dedicated to these scholarly activities.

secures funding
type: organizational contribution
type: NamedIndividual
comment: The contribution of securing funding for the research project. Note that an individual other than the lead applicant and the co-applicants on a grant application may make contributions to securing funding for a research project, for example by assisting in writing the grant application.

senior author
type: authorship role
type: NamedIndividual
comment: The role an author has of being the senior author of the document.

service engineer
type: investigation role
type: NamedIndividual
comment: The role held by a person who services, maintains and repairs equipment, facilities or technical infrastructure.

contributed all the effort
type: contribution effort
type: NamedIndividual
comment: The contributor was the only person who provided effort in achieving this contribution, which was entirely due to this contributor.

spokesperson
type: organizational role
type: NamedIndividual
comment: The role held by a person who makes statements on behalf of another individual, a group, a project or an institution

sponsor
type: financial role
type: NamedIndividual
comment: The role held by an agent that provides funds or support for something such as a project or activity, often in return for access to the exploitable commercial potential associated with that project or activity, for example through advertising. [Note: there are also several other non-financial meaning of 'sponsor'.]

stakeholder
type: organizational role
type: NamedIndividual
comment: The role held by an agent with an interest or concern in something, for example the creation of a new university.

sub-contractor
type: financial role
type: NamedIndividual
comment: The role held by an agent who enters into a contract to take over part of another contractor's obligation to undertake specified work or supply specified services in return for payment.

successor
type: organizational role
type: NamedIndividual
comment: The relationship held by an entity that succeeds another, for example a new electron microscope that replaces an out-dated one, a research project that follows on from a preceding project, or a faculty member who succeeds a colleague as head of department.

Supervises, mentors or trains colleagues
type: organizational contribution
type: NamedIndividual
comment: The contribution of supervising, mentoring, instructing or training colleagues, particularly junior research assistants and research students, in aspects of the research or its methodologies.

supervisor
type: educational role
type: NamedIndividual
comment: The role of a person who supervises the research activities of a student during that student's research project undertaken as part of a degree course at a university.

supplier
type: financial role
type: NamedIndividual
comment: The role held by an agent of providing goods or services in exchange for payment.

technician
type: investigation role
type: NamedIndividual
comment: The role a person has of being a technician, providing technical assistance in some endeavour such as a research investigation.

undergraduate student
type: educational role
type: NamedIndividual
comment: The role of a person registerd for an undergraduate degree at a university.

undertakes modelling
type: intellectual contribution
type: NamedIndividual
comment: The contribution of design, implementation and analysis of mathematical models or computer simulations.

vice-chancellor
type: organizational role
type: NamedIndividual
comment: The role held by the chief executive officer of a university, responsible for directing and managing its business and academic activities.

web-master
type: data role
type: NamedIndividual
comment: The role of a person responsible for maintaining a web site and its content.

workpackage leader
type: project role
type: NamedIndividual
comment: The role a person or institution has of being leader for a workpackage within a project such as a research project.

writes manuscript draft
type: authorship contribution
type: NamedIndividual
comment: The contribution of writing the initial draft of the manuscript of the research paper.

AllDifferent
type: Class
comment: The class of collections of pairwise different individuals.
subclass of: Resource

distinctMembers
type: Property
comment: The property that determines the collection of pairwise different individuals in a owl:AllDifferent axiom.
domain: AllDifferent
range: List

AllDisjointClasses
type: Class
comment: The class of collections of pairwise disjoint classes.
subclass of: Resource

members
type: Property
comment: The property that determines the collection of members in either a owl:AllDifferent, owl:AllDisjointClasses or owl:AllDisjointProperties axiom.
domain: Resource
range: List

geo
title: WGS84 Geo Positioning: an RDF vocabulary
comment: Recent changes to this namespace: $Log: wgs84_pos.rdf,v $ Revision 1.22 2009/04/20 15:00:30 timbl Remove the time bits which have been deal with elsewhere eg in iCal. Revision 1.21 2009/04/20 12:52:47 timbl try again Revision 1.20 2009/04/20 12:42:11 timbl Add Event (edited ages ago and never checked in), and location (following discussion http://chatlogs.planetrdf.com/swig/2009-04-20#T12-36-09) Revision 1.19 2009/04/20 12:36:31 timbl Add Event (edited ages ago and never checked in), and location (following discussion http://chatlogs.planetrdf.com/swig/2009-04-20#T12-36-09) Revision 1.18 2006/02/01 22:01:04 danbri Clarified that lat and long are decimal degrees, and that alt is decimal metres about local reference ellipsoid Revision 1.17 2004/02/06 17:38:12 danbri Fixed a bad commit screwup Revision 1.15 2003/04/19 11:24:08 danbri Fixed the typo even more. Revision 1.14 2003/04/19 11:16:56 danbri fixed a typo Revision 1.13 2003/02/19 22:27:27 connolly relaxed domain constraints on lat/long/alt from Point to SpatialThing Revision 1.12 2003/01/12 01:41:41 danbri Trying local copy of XSLT doc. Revision 1.11 2003/01/12 01:20:18 danbri added a link to morten's xslt rdfs viewer. Revision 1.10 2003/01/11 18:56:49 danbri Removed datatype range from lat and long properties, since they would have required each occurance of the property to mention the datatype. Revision 1.9 2003/01/11 11:41:31 danbri Another typo; repaired rdfs:Property to rdf:Property x4 Revision 1.8 2003/01/11 11:05:02 danbri Added an rdfs:range for each lat/long/alt property, http://www.w3.org/2001/XMLSchema#float Revision 1.7 2003/01/10 20:25:16 danbri Longer rdfs:comment for Point, trying to be Earth-centric and neutral about coordinate system(s) at the same time. Feedback welcomed. Revision 1.6 2003/01/10 20:18:30 danbri Added CVS log comments into the RDF/XML as an rdfs:comment property of the vocabulary. Note that this is not common practice (but seems both harmless and potentially useful). revision 1.…
date: $Date: 2009/04/20 15:00:30 $
description: A vocabulary for representing latitude, longitude and altitude information in the WGS84 geodetic reference datum. Version $Id: wgs84_pos.rdf,v 1.22 2009/04/20 15:00:30 timbl Exp $. See http://www.w3.org/2003/01/geo/ for more details.

point
type: Class
comment: A point, typically described using a coordinate system relative to Earth, such as WGS84.
comment: Uniquely identified by lat/long/alt. i.e. spaciallyIntersects(P1, P2) :- lat(P1, LAT), long(P1, LONG), alt(P1, ALT), lat(P2, LAT), long(P2, LONG), alt(P2, ALT). sameThing(P1, P2) :- type(P1, Point), type(P2, Point), spaciallyIntersects(P1, P2).
subclass of: Spatial Thing

latitude
type: Property
comment: The WGS84 latitude of a SpatialThing (decimal degrees).
domain: Spatial Thing

location
type: Property
comment: The relation between something and the point, or other geometrical thing in space, where it is. For example, the realtionship between a radio tower and a Point with a given lat and long. Or a relationship between a park and its outline as a closed arc of points, or a road and its location as a arc (a sequence of points). Clearly in practice there will be limit to the accuracy of any such statement, but one would expect an accuracy appropriate for the size of the object and uses such as mapping .
range: Spatial Thing
sub property of: based near

longitude
type: Property
comment: The WGS84 longitude of a SpatialThing (decimal degrees).
domain: Spatial Thing

altitude
type: Property
comment: The WGS84 altitude of a SpatialThing (decimal meters above the local reference ellipsoid).
domain: Spatial Thing

lat/long
type: Property
comment: A comma-separated representation of a latitude, longitude coordinate.

Roberts Engineering Building (UCL)
type: Conference Venue Place
type: Address
based near: London
is location of: XML London 2014
is location of: XML London 2013
is location of: XML London 2015
Online Account: uclengineering
latitude: 51.522676
longitude: -0.132083
postal code: WC1E 6BT
country name: United Kingdom
street address: Engineering Front Building, Torrington Place
locality: London

Address
type: Class
comment: To specify the components of the delivery address for the object
equivalentClass: Class
  unionOf: Class
    intersectionOf: Restriction
      onProperty: country name
      someValuesFrom: string
    intersectionOf: Restriction
      onProperty: country name
      maxCardinality: 1
  unionOf: Class
    intersectionOf: Restriction
      onProperty: locality
      someValuesFrom: string
    intersectionOf: Restriction
      onProperty: locality
      maxCardinality: 1
  unionOf: Class
    intersectionOf: Restriction
      onProperty: postal code
      someValuesFrom: string
    intersectionOf: Restriction
      onProperty: postal code
      maxCardinality: 1
  unionOf: Class
    intersectionOf: Restriction
      onProperty: region
      someValuesFrom: string
    intersectionOf: Restriction
      onProperty: region
      maxCardinality: 1
  unionOf: Class
    intersectionOf: Restriction
      onProperty: street address
      someValuesFrom: string
    intersectionOf: Restriction
      onProperty: street address
      maxCardinality: 1
equivalentClass: Class
  unionOf: Class
    intersectionOf: Restriction
      onProperty: country name
      someValuesFrom: string
    intersectionOf: Restriction
      onProperty: country name
      maxCardinality: 1
  unionOf: Class
    intersectionOf: Restriction
      onProperty: locality
      someValuesFrom: string
    intersectionOf: Restriction
      onProperty: locality
      maxCardinality: 1
  unionOf: Class
    intersectionOf: Restriction
      onProperty: postal code
      someValuesFrom: string
    intersectionOf: Restriction
      onProperty: postal code
      maxCardinality: 1
  unionOf: Class
    intersectionOf: Restriction
      onProperty: region
      someValuesFrom: string
    intersectionOf: Restriction
      onProperty: region
      maxCardinality: 1
  unionOf: Class
    intersectionOf: Restriction
      onProperty: street address
      someValuesFrom: string
    intersectionOf: Restriction
      onProperty: street address
      maxCardinality: 1

XML London 2013
type: Conference Event
has related document: 2013 Conference Proceedings
has role: 2013 Chair
has role: 2013 Programme Committee Member
has role: 2013 Presenter
has location: Roberts Engineering Building (UCL)
Online Account: about
Online Account: xmllondon
Sister Event: XML Prague 2013
Sister Event: XML Summer School 2013
Sister Event: XML Amsterdam 2013
Related Event: XML London 2014
Related Event: XML London 2015
Related Event: XML London 2016
Sponsored By: oXygen
Sponsored By: Mercator IT Solutions Ltd
Sponsored By: OverStory Consulting Ltd

XML London 2015
type: Conference Event
has related document: 2015 Conference Proceedings
has role: 2015 Chair
has role: 2015 Programme Committee Member
has role: 2015 Presenter
has location: Roberts Engineering Building (UCL)
Online Account: about
Online Account: xmllondon
Sister Event: XML Prague 2015
Sister Event: XML Summer School 2015
Sister Event: Balisage 2015
Related Event: XML London 2014
Related Event: XML London 2013
Related Event: XML London 2016
Sponsored By: MarkLogic
Sponsored By: Saxonica
Sponsored By: oXygen

postal code
type: DatatypeProperty
comment: The postal code associated with the address of the object
range: string

country name
type: DatatypeProperty
comment: The country name associated with the address of the object
range: string

street address
type: DatatypeProperty
comment: The street address associated with the address of the object
range: string

locality
type: DatatypeProperty
comment: The locality (e.g. city or town) associated with the address of the object
range: string

Sponsors Event
type: ObjectProperty
domain: Organization
range: Organised Event
inverseOf: Sponsored By

XML Prague 2015
type: Conference Event
Online Account: about
Online Account: xmlprague
Sister Event: XML London 2015
Sister Event: XML Summer School 2015
Sister Event: Balisage 2015
Sister Event: XML Amsterdam 2015
Related Event: XML Prague 2014
Related Event: XML Prague 2013
Related Event: XML Prague 2016

Sister Event
type: ObjectProperty
domain: Organised Event
range: Organised Event

XML Summer School 2015
type: Academic Event
Online Account: about
Online Account: xmlsummerschool
Sister Event: XML London 2015
Sister Event: XML Prague 2015
Sister Event: Balisage 2015
Related Event: XML Summer School 2014
Related Event: XML Summer School 2013
Related Event: XML Summer School 2016

Related Event
type: ObjectProperty
domain: Organised Event
range: OrganisedEvent

XML Prague 2014
type: Conference Event
Online Account: about
Online Account: xmlprague
Sister Event: XML London 2014
Sister Event: XML Summer School 2014
Sister Event: Balisage 2014
Related Event: XML Prague 2015
Related Event: XML Prague 2013
Related Event: XML Prague 2016

XML Prague 2013
type: Conference Event
Online Account: about
Online Account: xmlprague
Sister Event: XML London 2013
Sister Event: XML Summer School 2013
Sister Event: XML Amsterdam 2013
Sister Event: Balisage 2013
Related Event: XML Prague 2015
Related Event: XML Prague 2014
Related Event: XML Prague 2016

XML Summer School 2014
type: Academic Event
Online Account: about
Online Account: xmlsummerschool
Sister Event: XML London 2014
Sister Event: XML Prague 2014
Related Event: XML Summer School 2015
Related Event: XML Summer School 2013
Related Event: XML Summer School 2016

XML Summer School 2013
type: Academic Event
Online Account: about
Online Account: xmlsummerschool
Sister Event: XML London 2013
Sister Event: XML Prague 2013
Related Event: XML Summer School 2015
Related Event: XML Summer School 2014
Related Event: XML Summer School 2016

XML Amsterdam 2013
type: Organised Event
Online Account: xmlsummerschool
Online Account: XMLAmsterdam-4306747
Sister Event: XML London 2013
Sister Event: XML Prague 2013
Related Event: XML Amsterdam 2015

Acquaintance
type: Class
subclass of: Relation Type

Ontology for vCard
type: Ontology
comment: Ontology for vCard based on RFC6350
versionInfo: Final

Relation Type
type: Class
comment: Used for relation type codes. The URI of the relation type code must be used as the value for the Relation Type.

Agent
type: Class
subclass of: Relation Type

BBS
type: Class
comment: This class is deprecated
subclass of: Phone
deprecated: true

Phone
type: Class
comment: Used for telephone type codes. The URI of the telephone type code must be used as the value for the Telephone Type.

deprecated
type: AnnotationProperty
comment: The annotation property that indicates that a given entity has been deprecated.
domain: Resource
range: Resource

Car
type: Class
comment: This class is deprecated
subclass of: Phone
deprecated: true

Cell
type: Class
comment: Also called mobile telephone
subclass of: Phone

Child
type: Class
subclass of: Relation Type

Colleague
type: Class
subclass of: Relation Type

Contact
type: Class
subclass of: Relation Type

Coresident
type: Class
subclass of: Relation Type

Coworker
type: Class
subclass of: Relation Type

Crush
type: Class
subclass of: Relation Type

Date
type: Class
subclass of: Relation Type

Dom
type: Class
comment: This class is deprecated
subclass of: Type
deprecated: true

Type
type: Class
comment: Used for type codes. The URI of the type code must be used as the value for Type.

Emergency
type: Class
subclass of: Relation Type

Fax
type: Class
subclass of: Phone

Female
type: Class
subclass of: Gender

Gender
type: Class
comment: Used for gender codes. The URI of the gender code must be used as the value for Gender.

Friend
type: Class
subclass of: Relation Type

Home
type: Class
comment: This implies that the property is related to an individual's personal life
subclass of: Type

ISDN
type: Class
comment: This class is deprecated
subclass of: Type
deprecated: true

Internet
type: Class
comment: This class is deprecated
subclass of: Type
deprecated: true

Intl
type: Class
comment: This class is deprecated
subclass of: Type
deprecated: true

Kin
type: Class
subclass of: Relation Type

Label
type: Class
comment: This class is deprecated
subclass of: Type
deprecated: true

Male
type: Class
subclass of: Gender

Me
type: Class
subclass of: Relation Type

Met
type: Class
subclass of: Relation Type

Modem
type: Class
comment: This class is deprecated
subclass of: Phone
deprecated: true

Msg
type: Class
comment: This class is deprecated
subclass of: Phone
deprecated: true

Muse
type: Class
subclass of: Relation Type

Neighbor
type: Class
subclass of: Relation Type

None
type: Class
subclass of: Gender

Other
type: Class
subclass of: Gender

PCS
type: Class
comment: This class is deprecated
subclass of: Phone
deprecated: true

Pager
type: Class
subclass of: Phone

Parcel
type: Class
comment: This class is deprecated
subclass of: Type
deprecated: true

Parent
type: Class
subclass of: Relation Type

Postal
type: Class
comment: This class is deprecated
subclass of: Type
deprecated: true

Pref
type: Class
comment: This class is deprecated
subclass of: Type
deprecated: true

Sibling
type: Class
subclass of: Relation Type

Spouse
type: Class
subclass of: Relation Type

Sweetheart
type: Class
subclass of: Relation Type

Tel
type: Class
comment: This class is deprecated. Use the hasTelephone object property.
deprecated: true

Text
type: Class
comment: Also called sms telephone
subclass of: Phone

Text phone
type: Class
subclass of: Phone

Unknown
type: Class
subclass of: Gender

Video
type: Class
subclass of: Phone

Voice
type: Class
subclass of: Phone

Work
type: Class
comment: This implies that the property is related to an individual's work place
subclass of: Type

X400
type: Class
comment: This class is deprecated
subclass of: Type
deprecated: true

address
type: ObjectProperty
comment: This object property has been mapped
equivalentProperty: has address

has address
type: ObjectProperty
comment: To specify the components of the delivery address for the object
range: Address

agent
type: ObjectProperty
comment: This object property has been deprecated
deprecated: true

anniversary
type: DatatypeProperty
comment: The date of marriage, or equivalent, of the object
range: Datatype
  unionOf: dateTime
  unionOf: gYear
range: Datatype
  unionOf: dateTime
  unionOf: gYear

birth date
type: DatatypeProperty
comment: To specify the birth date of the object
range: Datatype
  unionOf: dateTime
  unionOf: dateTimeStamp
  unionOf: gYear
range: Datatype
  unionOf: dateTime
  unionOf: dateTimeStamp
  unionOf: gYear

category
type: DatatypeProperty
comment: The category information about the object, also known as tags
range: string

class
type: DatatypeProperty
comment: This data property has been deprecated
deprecated: true

email
type: ObjectProperty
comment: This object property has been mapped
equivalentProperty: has email

has email
type: ObjectProperty
comment: To specify the electronic mail address for communication with the object
range: Email

extended address
type: DatatypeProperty
comment: This data property has been deprecated
deprecated: true

geo
type: ObjectProperty
comment: This object property has been mapped
equivalentProperty: has geo

has geo
type: ObjectProperty
comment: To specify information related to the global positioning of the object. May also be used as a property parameter.

has additional name
type: ObjectProperty
comment: Used to support property parameters for the additional name data property

has calendar busy
type: ObjectProperty
comment: To specify the busy time associated with the object. (Was called FBURL in RFC6350)

has calendar link
type: ObjectProperty
comment: To specify the calendar associated with the object. (Was called CALURI in RFC6350)

has calendar request
type: ObjectProperty
comment: To specify the calendar user address to which a scheduling request be sent for the object. (Was called CALADRURI in RFC6350)

has category
type: ObjectProperty
comment: Used to support property parameters for the category data property

has country name
type: ObjectProperty
comment: Used to support property parameters for the country name data property

has formatted name
type: ObjectProperty
comment: Used to support property parameters for the formatted name data property

has family name
type: ObjectProperty
comment: Used to support property parameters for the family name data property

has gender
type: ObjectProperty
comment: To specify the sex or gender identity of the object. URIs are recommended to enable interoperable sex and gender codes to be used.

has given name
type: ObjectProperty
comment: Used to support property parameters for the given name data property

has honorific prefix
type: ObjectProperty
comment: Used to support property parameters for the honorific prefix data property

has honorific suffix
type: ObjectProperty
comment: Used to support property parameters for the honorific suffix data property

has messaging
type: ObjectProperty
comment: To specify the instant messaging and presence protocol communications with the object. (Was called IMPP in RFC6350)

has language
type: ObjectProperty
comment: Used to support property parameters for the language data property

has locality
type: ObjectProperty
comment: Used to support property parameters for the locality data property

has nickname
type: ObjectProperty
comment: Used to support property parameters for the nickname data property

nickname
type: DatatypeProperty
comment: The nick name associated with the object
range: string

has note
type: ObjectProperty
comment: Used to support property parameters for the note data property

has organization name
type: ObjectProperty
comment: Used to support property parameters for the organization name data property

has organization unit name
type: ObjectProperty
comment: Used to support property parameters for the organization unit name data property

has postal code
type: ObjectProperty
comment: Used to support property parameters for the postal code data property

has region
type: ObjectProperty
comment: Used to support property parameters for the region data property

has related
type: ObjectProperty
comment: To specify a relationship between another entity and the entity represented by this object

has role
type: ObjectProperty
comment: Used to support property parameters for the role data property

has source
type: ObjectProperty
comment: To identify the source of directory information of the object

has street address
type: ObjectProperty
comment: Used to support property parameters for the street address data property

has title
type: ObjectProperty
comment: Used to support property parameters for the title data property

has uid
type: ObjectProperty
comment: To specify a value that represents a globally unique identifier corresponding to the object

has value
type: ObjectProperty
comment: Used to indicate the resource value of an object property that requires property parameters

label
type: DatatypeProperty
comment: This data property has been deprecated
deprecated: true

language
type: DatatypeProperty
comment: To specify the language that may be used for contacting the object. May also be used as a property parameter.

latitude
type: DatatypeProperty
comment: This data property has been deprecated. See hasGeo
deprecated: true

longitude
type: DatatypeProperty
comment: This data property has been deprecated. See hasGeo
deprecated: true

mailer
type: DatatypeProperty
comment: This data property has been deprecated
deprecated: true

note
type: DatatypeProperty
comment: A note associated with the object
range: string

organization
type: ObjectProperty
comment: This object property has been mapped. Use the organization-name data property.
equivalentProperty: organization name

organization name
type: DatatypeProperty
comment: To specify the organizational name associated with the object
range: string

organizational unit name
type: DatatypeProperty
comment: To specify the organizational unit name associated with the object
range: string
sub property of: organization name

post office box
type: DatatypeProperty
comment: This data property has been deprecated
deprecated: true

product id
type: DatatypeProperty
comment: To specify the identifier for the product that created the object
range: string

revision
type: DatatypeProperty
comment: To specify revision information about the object
range: dateTime

role
type: DatatypeProperty
comment: To specify the function or part played in a particular situation by the object
range: string

sort as
type: DatatypeProperty
comment: To specify the string to be used for national-language-specific sorting. Used as a property parameter only.
range: string

title
type: DatatypeProperty
comment: To specify the position or job of the object
range: string

time zone
type: DatatypeProperty
comment: To indicate time zone information that is specific to the object. May also be used as a property parameter.
range: string

value
type: DatatypeProperty
comment: Used to indicate the literal value of a data property that requires property parameters

maxCardinality
type: Property
comment: The property that determines the cardinality of a maximum cardinality restriction.
domain: Restriction
range: nonNegativeInteger

region
type: DatatypeProperty
comment: The region (e.g. state or province) associated with the address of the object
range: string

Email
type: Class
comment: To specify the electronic mail address for communication with the object the vCard represents. Use the hasEmail object property.
deprecated: true

Group
type: Class
comment: Object representing a group of persons or entities. A group object will usually contain hasMember properties to specify the members of the group.
subclass of: Kind
equivalentClass: Class
  intersectionOf: Restriction
    onProperty: has member
    someValuesFrom: Kind
  intersectionOf: Restriction
    onProperty: has member
    minQualifiedCardinality: 1
    onClass: Kind
equivalentClass: Class
  intersectionOf: Restriction
    onProperty: has member
    someValuesFrom: Kind
  intersectionOf: Restriction
    onProperty: has member
    minQualifiedCardinality: 1
    onClass: Kind
disjointWith: Individual
disjointWith: Location
disjointWith: Organization

Kind
type: Class
comment: The parent class for all objects
equivalentClass: VCard
equivalentClass: Restriction
  onProperty: formatted name
  minQualifiedCardinality: 1
  onDataRange: string
equivalentClass: Restriction
  onProperty: formatted name
  minQualifiedCardinality: 1
  onDataRange: string

Individual
type: Class
comment: An object representing a single person or entity
subclass of: Kind
disjointWith: Location
disjointWith: Organization

Location
type: Class
comment: An object representing a named geographical place
subclass of: Kind
disjointWith: Organization

Organization
type: Class
comment: An object representing an organization. An organization is a single entity, and might represent a business or government, a department or division within a business or government, a club, an association, or the like.
subclass of: Kind

has member
type: ObjectProperty
comment: To include a member in the group this object represents. (This property can only be used by Group individuals)
domain: Group
range: Kind

minQualifiedCardinality
type: Property
comment: The property that determines the cardinality of a minimum qualified cardinality restriction.
domain: Restriction
range: nonNegativeInteger

onClass
type: Property
comment: The property that determines the class that a qualified object cardinality restriction refers to.
domain: Restriction
range: Class

Name
type: Class
comment: To specify the components of the name of the object
equivalentClass: Class
  unionOf: Class
    intersectionOf: Restriction
      onProperty: additional name
      someValuesFrom: string
    intersectionOf: Restriction
      onProperty: additional name
      minCardinality: 0
  unionOf: Class
    intersectionOf: Restriction
      onProperty: family name
      someValuesFrom: string
    intersectionOf: Restriction
      onProperty: family name
      maxCardinality: 1
  unionOf: Class
    intersectionOf: Restriction
      onProperty: given name
      someValuesFrom: string
    intersectionOf: Restriction
      onProperty: given name
      maxCardinality: 1
  unionOf: Class
    intersectionOf: Restriction
      onProperty: honorific prefix
      someValuesFrom: string
    intersectionOf: Restriction
      onProperty: honorific prefix
      minCardinality: 0
  unionOf: Class
    intersectionOf: Restriction
      onProperty: honorific suffix
      someValuesFrom: string
    intersectionOf: Restriction
      onProperty: honorific suffix
      minCardinality: 0
equivalentClass: Class
  unionOf: Class
    intersectionOf: Restriction
      onProperty: additional name
      someValuesFrom: string
    intersectionOf: Restriction
      onProperty: additional name
      minCardinality: 0
  unionOf: Class
    intersectionOf: Restriction
      onProperty: family name
      someValuesFrom: string
    intersectionOf: Restriction
      onProperty: family name
      maxCardinality: 1
  unionOf: Class
    intersectionOf: Restriction
      onProperty: given name
      someValuesFrom: string
    intersectionOf: Restriction
      onProperty: given name
      maxCardinality: 1
  unionOf: Class
    intersectionOf: Restriction
      onProperty: honorific prefix
      someValuesFrom: string
    intersectionOf: Restriction
      onProperty: honorific prefix
      minCardinality: 0
  unionOf: Class
    intersectionOf: Restriction
      onProperty: honorific suffix
      someValuesFrom: string
    intersectionOf: Restriction
      onProperty: honorific suffix
      minCardinality: 0

additional name
type: DatatypeProperty
comment: The additional name associated with the object
range: string

minCardinality
type: Property
comment: The property that determines the cardinality of a minimum cardinality restriction.
domain: Restriction
range: nonNegativeInteger

family name
type: DatatypeProperty
comment: The family name associated with the object
range: string

given name
type: DatatypeProperty
comment: The given name associated with the object
range: string

honorific prefix
type: DatatypeProperty
comment: The honorific prefix of the name associated with the object
range: string

honorific suffix
type: DatatypeProperty
comment: The honorific suffix of the name associated with the object
range: string

VCard
type: Class
comment: The vCard class is equivalent to the new Kind class, which is the parent for the four explicit types of vCards (Individual, Organization, Location, Group)
equivalentClass: Kind

formatted name
type: DatatypeProperty
comment: The formatted text corresponding to the name of the object
range: string

has key
type: ObjectProperty
comment: To specify a public key or authentication certificate associated with the object
equivalentProperty: key

key
type: ObjectProperty
comment: This object property has been mapped
equivalentProperty: has key

has logo
type: ObjectProperty
comment: To specify a graphic image of a logo associated with the object
equivalentProperty: logo

logo
type: ObjectProperty
comment: This object property has been mapped
equivalentProperty: has logo

has name
type: ObjectProperty
comment: To specify the components of the name of the object
range: Name
equivalentProperty: name

name
type: ObjectProperty
comment: This object property has been mapped
equivalentProperty: has name

has photo
type: ObjectProperty
comment: To specify an image or photograph information that annotates some aspect of the object
equivalentProperty: photo

photo
type: ObjectProperty
comment: This object property has been mapped
equivalentProperty: has photo

has sound
type: ObjectProperty
comment: To specify a digital sound content information that annotates some aspect of the object
equivalentProperty: sound

sound
type: ObjectProperty
comment: This object property has been mapped
equivalentProperty: has sound

has telephone
type: ObjectProperty
comment: To specify the telephone number for telephony communication with the object
equivalentProperty: telephone

telephone
type: ObjectProperty
comment: This object property has been mapped
equivalentProperty: has telephone

has url
type: ObjectProperty
comment: To specify a uniform resource locator associated with the object
equivalentProperty: url

url
type: ObjectProperty
comment: This object property has been mapped
equivalentProperty: has url

onDataRange
type: Property
comment: The property that determines the data range that a qualified data cardinality restriction refers to.
domain: Restriction
range: Datatype

Sponsored By
type: ObjectProperty
domain: Organised Event
range: Organization
inverseOf: Sponsors Event

2015 Presenter
type: Presenter
held by: Eric Van Der Vlist
held by: James Fuller
held by: Abel Braaksma
held by: Sandro Cirulli
held by: George Bina
held by: Steven Pemberton
held by: Adam Retter
held by: Norman Walsh
held by: Andrew Sales
held by: Andy Seaborne
held by: Chris de Vreeze
held by: Fabio Labella
held by: John Lumley
held by: Nic Gibson
held by: Philip Fearon
held by: Shinyu Murakami
is role at: XML London 2015

Dublin Core Metadata Element Set, Version 1.1
modified: 2012-06-14
publisher: DCMI

publisher
type: ObjectProperty
scope note: Used to link a bibliographic item to its publisher.

description
type: DatatypeProperty
type: AnnotationProperty
scope note: Used to describe a bibliographic resource.

issued
type: DatatypeProperty
sub property of: date
scope note: Used to describe the issue date of a bibliographic resource

Coverage
type: Property
modified: 2008-01-14
has version: coverage-006
comment: The spatial or temporal topic of the resource, the spatial applicability of the resource, or the jurisdiction under which the resource is relevant.
description: Spatial topic and spatial applicability may be a named place or a location specified by its geographic coordinates. Temporal topic may be a named period, date, or date range. A jurisdiction may be a named administrative entity or a geographic place to which the resource applies. Recommended best practice is to use a controlled vocabulary such as the Thesaurus of Geographic Names [TGN]. Where appropriate, named places or time periods can be used in preference to numeric identifiers such as sets of coordinates or date ranges.
issued: 1999-07-02
note: A second property with the same name as this property has been declared in the dcterms: namespace (http://purl.org/dc/terms/). See the Introduction to the document "DCMI Metadata Terms" (http://dublincore.org/documents/dcmi-terms/) for an explanation.

Format
type: Property
modified: 2008-01-14
has version: format-007
comment: The file format, physical medium, or dimensions of the resource.
description: Examples of dimensions include size and duration. Recommended best practice is to use a controlled vocabulary such as the list of Internet Media Types [MIME].
issued: 1999-07-02
note: A second property with the same name as this property has been declared in the dcterms: namespace (http://purl.org/dc/terms/). See the Introduction to the document "DCMI Metadata Terms" (http://dublincore.org/documents/dcmi-terms/) for an explanation.

Language
type: Property
modified: 2008-01-14
has version: language-007
comment: A language of the resource.
description: Recommended best practice is to use a controlled vocabulary such as RFC 4646 [RFC4646].
issued: 1999-07-02
note: A second property with the same name as this property has been declared in the dcterms: namespace (http://purl.org/dc/terms/). See the Introduction to the document "DCMI Metadata Terms" (http://dublincore.org/documents/dcmi-terms/) for an explanation.

Publisher
type: Property
modified: 2008-01-14
has version: publisher-006
comment: An entity responsible for making the resource available.
description: Examples of a Publisher include a person, an organization, or a service. Typically, the name of a Publisher should be used to indicate the entity.
issued: 1999-07-02
note: A second property with the same name as this property has been declared in the dcterms: namespace (http://purl.org/dc/terms/). See the Introduction to the document "DCMI Metadata Terms" (http://dublincore.org/documents/dcmi-terms/) for an explanation.

Relation
type: Property
modified: 2008-01-14
has version: relation-006
comment: A related resource.
description: Recommended best practice is to identify the related resource by means of a string conforming to a formal identification system.
issued: 1999-07-02
note: A second property with the same name as this property has been declared in the dcterms: namespace (http://purl.org/dc/terms/). See the Introduction to the document "DCMI Metadata Terms" (http://dublincore.org/documents/dcmi-terms/) for an explanation.

Source
type: Property
modified: 2008-01-14
has version: source-006
comment: A related resource from which the described resource is derived.
description: The described resource may be derived from the related resource in whole or in part. Recommended best practice is to identify the related resource by means of a string conforming to a formal identification system.
issued: 1999-07-02
note: A second property with the same name as this property has been declared in the dcterms: namespace (http://purl.org/dc/terms/). See the Introduction to the document "DCMI Metadata Terms" (http://dublincore.org/documents/dcmi-terms/) for an explanation.

Type
type: Property
modified: 2008-01-14
has version: type-006
comment: The nature or genre of the resource.
description: Recommended best practice is to use a controlled vocabulary such as the DCMI Type Vocabulary [DCMITYPE]. To describe the file format, physical medium, or dimensions of the resource, use the Format element.
issued: 1999-07-02
note: A second property with the same name as this property has been declared in the dcterms: namespace (http://purl.org/dc/terms/). See the Introduction to the document "DCMI Metadata Terms" (http://dublincore.org/documents/dcmi-terms/) for an explanation.

The OWL 2 Schema vocabulary (OWL 2)
type: Ontology
imports: rdf-schema
comment: This ontology partially describes the built-in classes and properties that together form the basis of the RDF/XML syntax of OWL 2. The content of this ontology is based on Tables 6.1 and 6.2 in Section 6.4 of the OWL 2 RDF-Based Semantics specification, available at http://www.w3.org/TR/owl2-rdf-based-semantics/. Please note that those tables do not include the different annotations (labels, comments and rdfs:isDefinedBy links) used in this file. Also note that the descriptions provided in this ontology do not provide a complete and correct formal description of either the syntax or the semantics of the introduced terms (please see the OWL 2 recommendations for the complete and normative specifications). Furthermore, the information provided by this ontology may be misleading if not used with care. This ontology SHOULD NOT be imported into OWL ontologies. Importing this file into an OWL 2 DL ontology will cause it to become an OWL 2 Full ontology and may have other, unexpected, consequences.
versionInfo: $Date: 2009/11/15 10:54:12 $
namespace transformation: owx2rdf.xsl

versionIRI
type: OntologyProperty
comment: The property that identifies the version IRI of an ontology.
domain: Ontology
range: Ontology

AllDisjointProperties
type: Class
comment: The class of collections of pairwise disjoint properties.
subclass of: Resource

Annotation
type: Class
comment: The class of annotated annotations for which the RDF serialization consists of an annotated subject, predicate and object.
subclass of: Resource

AsymmetricProperty
type: Class
comment: The class of asymmetric properties.
subclass of: ObjectProperty

Axiom
type: Class
comment: The class of annotated axioms for which the RDF serialization consists of an annotated subject, predicate and object.
subclass of: Resource

DataRange
type: Class
comment: The class of OWL data ranges, which are special kinds of datatypes. Note: The use of the IRI owl:DataRange has been deprecated as of OWL 2. The IRI rdfs:Datatype SHOULD be used instead.
subclass of: Datatype

IrreflexiveProperty
type: Class
comment: The class of irreflexive properties.
subclass of: ObjectProperty

NegativePropertyAssertion
type: Class
comment: The class of negative property assertions.
subclass of: Resource

Nothing
type: Class
comment: This is the empty class.
subclass of: Thing

OntologyProperty
type: Class
comment: The class of ontology properties.
subclass of: Property

ReflexiveProperty
type: Class
comment: The class of reflexive properties.
subclass of: ObjectProperty

annotatedProperty
type: Property
comment: The property that determines the predicate of an annotated axiom or annotated annotation.
domain: Resource
range: Resource

annotatedSource
type: Property
comment: The property that determines the subject of an annotated axiom or annotated annotation.
domain: Resource
range: Resource

annotatedTarget
type: Property
comment: The property that determines the object of an annotated axiom or annotated annotation.
domain: Resource
range: Resource

assertionProperty
type: Property
comment: The property that determines the predicate of a negative property assertion.
domain: NegativePropertyAssertion
range: Property

backwardCompatibleWith
type: AnnotationProperty
type: OntologyProperty
comment: The annotation property that indicates that a given ontology is backward compatible with another ontology.
domain: Ontology
range: Ontology

bottomDataProperty
type: DatatypeProperty
comment: The data property that does not relate any individual to any data value.
domain: Thing
range: Literal

bottomObjectProperty
type: ObjectProperty
comment: The object property that does not relate any two individuals.
domain: Thing
range: Thing

cardinality
type: Property
comment: The property that determines the cardinality of an exact cardinality restriction.
domain: Restriction
range: nonNegativeInteger

complementOf
type: Property
comment: The property that determines that a given class is the complement of another class.
domain: Class
range: Class

datatypeComplementOf
type: Property
comment: The property that determines that a given data range is the complement of another data range with respect to the data domain.
domain: Datatype
range: Datatype

differentFrom
type: Property
comment: The property that determines that two given individuals are different.
domain: Thing
range: Thing

disjointUnionOf
type: Property
comment: The property that determines that a given class is equivalent to the disjoint union of a collection of other classes.
domain: Class
range: List

hasSelf
type: Property
comment: The property that determines the property that a self restriction refers to.
domain: Restriction
range: Resource

hasValue
type: Property
comment: The property that determines the individual that a has-value restriction refers to.
domain: Restriction
range: Resource

incompatibleWith
type: AnnotationProperty
type: OntologyProperty
comment: The annotation property that indicates that a given ontology is incompatible with another ontology.
domain: Ontology
range: Ontology

maxQualifiedCardinality
type: Property
comment: The property that determines the cardinality of a maximum qualified cardinality restriction.
domain: Restriction
range: nonNegativeInteger

onDatatype
type: Property
comment: The property that determines the datatype that a datatype restriction refers to.
domain: Datatype
range: Datatype

oneOf
type: Property
comment: The property that determines the collection of individuals or data values that build an enumeration.
domain: Class
range: List

onProperties
type: Property
comment: The property that determines the n-tuple of properties that a property restriction on an n-ary data range refers to.
domain: Restriction
range: List

priorVersion
type: AnnotationProperty
type: OntologyProperty
comment: The annotation property that indicates the predecessor ontology of a given ontology.
domain: Ontology
range: Ontology

propertyDisjointWith
type: Property
comment: The property that determines that two given properties are disjoint.
domain: Property
range: Property

qualifiedCardinality
type: Property
comment: The property that determines the cardinality of an exact qualified cardinality restriction.
domain: Restriction
range: nonNegativeInteger

sourceIndividual
type: Property
comment: The property that determines the subject of a negative property assertion.
domain: NegativePropertyAssertion
range: Thing

targetIndividual
type: Property
comment: The property that determines the object of a negative object property assertion.
domain: NegativePropertyAssertion
range: Thing

targetValue
type: Property
comment: The property that determines the value of a negative data property assertion.
domain: NegativePropertyAssertion
range: Literal

topDataProperty
type: DatatypeProperty
comment: The data property that relates every individual to every data value.
domain: Thing
range: Literal

topObjectProperty
type: ObjectProperty
comment: The object property that relates every two individuals.
domain: Thing
range: Thing

withRestrictions
type: Property
comment: The property that determines the collection of facet-value pairs that define a datatype restriction.
domain: Datatype
range: List

The Bibliographic Ontology
type: Ontology
creator: Bruce D'Arcus
creator: Frederick Giasson
versionInfo: http://purl.org/ontology/bibo/1.3/
description: The Bibliographic Ontology describe bibliographic things on the semantic Web in RDF. This ontology can be used as a citation ontology, as a document classification ontology, or simply as a way to describe any kind of document in RDF. It has been inspired by many existing document description metadata formats, and can be used as a common ground for converting other bibliographic data sources.

Bruce D'Arcus
type: Person
type: Thing

Frederick Giasson
type: Person
type: Thing

agent
type: ObjectProperty
change note: Used to link an agent (a person) to an event (a conference, an hearing, etc.)

place
type: ObjectProperty
scope note: Used to relate an event such as a conference to the geographical place where it happens, for example Paris.

product
type: ObjectProperty
scope note: Used to link an event such as a conference to an outcome (a product) of that event, for example, an article, a proceeding, etc.

sub event
type: ObjectProperty
scope note: Used to link big events with smaller events such as workshops that happen in the context of a conference.

time
type: ObjectProperty
scope note: Used to describe the timing of an event. For example, when a conference starts and stops.

format
type: ObjectProperty
scope note: Used to describe the format of a bibliographic resource.
example: <dcterms:format> <dcterms:MediaTypeOrExtent> <rdf:value>text/html</rdf:value> <rdfs:label>HTML</rdfs:label> </dcterms:MediaTypeOrExtent> </dcterms:format>

isReferencedBy
type: ObjectProperty
scope note: Used to relate a reference citation to a bibliographic resource.

language
type: ObjectProperty
scope note: Used to link a bibliographic resource to the language used to express it.

rights
type: ObjectProperty
scope note: Used to describe rights related to a bibliographic resource.

affirmedBy
type: ObjectProperty
comment: A legal decision that affirms a ruling.
domain: Decision
range: Decision
sub property of: subsequentLegalDecision

Decision
type: Class
comment: A document containing an authoritative determination (as a decree or judgment) made after consideration of facts or law.
term status: unstable
subclass of: Legal Case Document

subsequentLegalDecision
type: ObjectProperty
comment: A legal decision on appeal that takes action on a case (affirming it, reversing it, etc.).
domain: Decision
range: Decision
sub property of: isReferencedBy

annotates
type: ObjectProperty
comment: Critical or explanatory note for a Document.
term status: stable
domain: Note
range: Resource
sub property of: relation

Note
type: Class
comment: Notes or annotations about a resource.
term status: stable
subclass of: Document

Document
type: Class
comment: A document (noun) is a bounded physical representation of body of information designed with the capacity (and usually intent) to communicate. A document may manifest symbolic, diagrammatic or sensory-representational information.
term status: stable
equivalentClass: Document

list of contributors
type: ObjectProperty
comment: An ordered list of contributors. Normally, this list is seen as a priority list that order contributors by importance.
term status: stable
domain: Document
range: Class
  unionOf: List
  unionOf: Seq
range: Class
  unionOf: List
  unionOf: Seq

cited by
type: ObjectProperty
comment: Relates a document to another document that cites the first document.
term status: unstable
domain: Document
range: Document
inverseOf: cites

cites
type: ObjectProperty
comment: Relates a document to another document that is cited by the first document as reference, comment, review, quotation or for another purpose.
term status: unstable
domain: Document
range: Document
sub property of: references

court
type: ObjectProperty
comment: A court associated with a legal document; for example, that which issues a decision.
term status: unstable
domain: Legal Document
range: Organization

Legal Document
type: Class
comment: A legal document; for example, a court decision, a brief, and so forth.
term status: stable
subclass of: Document

status
type: ObjectProperty
comment: The thesis degree.
term status: unstable
domain: Thesis
range: Thesis degree
editorial note: We are not defining, using an enumeration, the range of the bibo:degree to the defined list of bibo:ThesisDegree. We won't do it because we want people to be able to define new degress if needed by some special usecases. Creating such an enumeration would restrict this to happen.

Thesis
type: Class
comment: A document created to summarize research findings associated with the completion of an academic degree.
term status: stable
subclass of: Document

Thesis degree
type: Class
comment: The academic degree of a Thesis
term status: stable

director
type: ObjectProperty
comment: A Film director.
term status: stable
domain: audio-visual document
range: Agent
sub property of: contributor

audio-visual document
type: Class
comment: An audio-visual document; film, video, and so forth.
term status: stable
subclass of: Document

distributor
type: ObjectProperty
comment: Distributor of a document or a collection of documents.
term status: stable
domain: Class
  unionOf: Collection
  unionOf: Document
domain: Class
  unionOf: Collection
  unionOf: Document
range: Agent

Collection
type: Class
comment: A collection of Documents or Collections
term status: stable
subclass of: Restriction
  allValuesFrom: Class
    unionOf: Collection
    unionOf: Document
  onProperty: hasPart
subclass of: Restriction
  allValuesFrom: Class
    unionOf: Collection
    unionOf: Document
  onProperty: hasPart

editor
type: ObjectProperty
comment: A person having managerial and sometimes policy-making responsibility for the editorial part of a publishing firm or of a newspaper, magazine, or other publication.
term status: stable
domain: Class
  unionOf: Collection
  unionOf: Document
domain: Class
  unionOf: Collection
  unionOf: Document
range: Agent
sub property of: contributor

list of editors
type: ObjectProperty
comment: An ordered list of editors. Normally, this list is seen as a priority list that order editors by importance.
term status: stable
domain: Document
range: Class
  unionOf: List
  unionOf: Seq
range: Class
  unionOf: List
  unionOf: Seq
sub property of: list of contributors

interviewee
type: ObjectProperty
comment: An agent that is interviewed by another agent.
term status: stable
domain: Agent
range: Agent
sub property of: contributor

interviewer
type: ObjectProperty
comment: An agent that interview another agent.
term status: stable
domain: Agent
range: Agent
sub property of: contributor

issuer
type: ObjectProperty
comment: An entity responsible for issuing often informally published documents such as press releases, reports, etc.
term status: unstable
domain: Class
  unionOf: Collection
  unionOf: Document
domain: Class
  unionOf: Collection
  unionOf: Document
range: Agent
sub property of: publisher

organizer
type: ObjectProperty
comment: The organizer of an event; includes conference organizers, but also government agencies or other bodies that are responsible for conducting hearings.
term status: unstable
domain: Event
range: Agent

Event
type: Class
scope note: Used to describe bibliographic related events such as conferences, hearing, etc.

owner
type: ObjectProperty
comment: Owner of a document or a collection of documents.
term status: unstable
domain: Class
  unionOf: Collection
  unionOf: Document
domain: Class
  unionOf: Collection
  unionOf: Document
range: Agent

performer
type: ObjectProperty
term status: stable
domain: Performance
range: Agent
sub property of: contributor

Performance
type: Class
comment: A public performance.
term status: unstable
subclass of: Event

presented at
type: ObjectProperty
comment: Relates a document to an event; for example, a paper to a conference.
term status: unstable
domain: Document
range: Event
sub property of: produced in

presented at
type: ObjectProperty
comment: Relates an event to associated documents; for example, conference to a paper.
term status: unstable
domain: Event
range: Document
inverseOf: presented at
sub property of: product

producer
type: ObjectProperty
comment: Producer of a document or a collection of documents.
term status: stable
domain: Class
  unionOf: Collection
  unionOf: Document
domain: Class
  unionOf: Collection
  unionOf: Document
range: Agent

recipient
type: ObjectProperty
comment: An agent that receives a communication document.
term status: stable
domain: Personal Communication Document
range: Agent

Personal Communication Document
type: Class
comment: A personal communication manifested in some document.
term status: stable
subclass of: Document

reproducedIn
type: ObjectProperty
comment: The resource in which another resource is reproduced.
term status: unstable
domain: Document
range: Document
sub property of: isPartOf

reversedBy
type: ObjectProperty
comment: A legal decision that reverses a ruling.
domain: Decision
range: Decision
sub property of: subsequentLegalDecision

review of
type: ObjectProperty
comment: Relates a review document to a reviewed thing (resource, item, etc.).
term status: stable
domain: Document
range: Resource
sub property of: relation

status
type: ObjectProperty
comment: The publication status of (typically academic) content.
term status: stable
domain: Document
range: Document Status
editorial note: We are not defining, using an enumeration, the range of the bibo:status to the defined list of bibo:DocumentStatus. We won't do it because we want people to be able to define new status if needed by some special usecases. Creating such an enumeration would restrict this to happen.

Document Status
type: Class
comment: The status of the publication of a document.
term status: stable

transcript of
type: ObjectProperty
comment: Relates a document to some transcribed original.
term status: unstable
domain: Document
range: Resource
sub property of: relation

translation of
type: ObjectProperty
comment: Relates a translated document to the original document.
term status: stable
domain: Document
range: Document
sub property of: isVersionOf

translator
type: ObjectProperty
comment: A person who translates written document from one language to another.
term status: stable
domain: Class
  unionOf: Collection
  unionOf: Document
domain: Class
  unionOf: Collection
  unionOf: Document
range: Agent
sub property of: contributor

value
type: ObjectProperty
scope note: Used to describe the content of a bibo:Document and othr bibliographic resouces. We suggest to use this property instead of the deprecated "bibo:content" one.

edition
type: DatatypeProperty
comment: The name defining a special edition of a document. Normally its a literal value composed of a version number and words.
term status: stable
domain: Document
range: Literal

locator
type: DatatypeProperty
comment: A description (often numeric) that locates an item within a containing document or collection.
term status: stable
domain: Document
range: Literal

volume
type: DatatypeProperty
comment: A volume number
term status: stable
domain: Document
range: Literal
sub property of: locator

date
type: DatatypeProperty
scope note: Use to link a bibliographic item to the date of an event. Check dcterms:created and other for proper specializations for this property

abstract
type: DatatypeProperty
comment: A summary of the resource.
term status: stable
domain: Resource
range: Literal

date argued
type: DatatypeProperty
comment: The date on which a legal case is argued before a court. Date is of format xsd:date
term status: unstable
domain: Legal Document
range: Literal

chapter
type: DatatypeProperty
comment: An chapter number
term status: unstable
domain: Book Section
range: Literal
sub property of: locator

Book Section
type: Class
comment: A section of a book.
term status: unstable
subclass of: document part

content
type: DatatypeProperty
comment: This property is for a plain-text rendering of the content of a Document. While the plain-text content of an entire document could be described by this property.
term status: unstable
domain: Document
range: Literal
deprecated: true
history note: bibo:content has been deprecated; we recommend to use "rdf:value" for this purpose. Here is the rational behind this choice: http://www.w3.org/TR/2004/REC-rdf-primer-20040210/#rdfvalue

issue
type: DatatypeProperty
comment: An issue number
term status: stable
domain: Issue
range: Literal
sub property of: locator

Issue
type: Class
comment: something that is printed or published and distributed, esp. a given number of a periodical
term status: stable
subclass of: Collected Document
subclass of: Restriction
  onProperty: hasPart
  minCardinality: 1
subclass of: Restriction
  allValuesFrom: Article
  onProperty: hasPart
subclass of: Restriction
  onProperty: hasPart
  minCardinality: 1
subclass of: Restriction
  allValuesFrom: Article
  onProperty: hasPart

number of pages
type: DatatypeProperty
comment: The number of pages contained in a document
term status: stable
domain: Document
range: Literal

number of volumes
type: DatatypeProperty
comment: The number of volumes contained in a collection of documents (usually a series, periodical, etc.).
term status: stable
domain: Collection
range: Literal

number
type: DatatypeProperty
comment: A generic item or document number. Not to be confused with issue number.
term status: stable
domain: Document
range: Literal

pages
type: DatatypeProperty
comment: A string of non-contiguous page spans that locate a Document within a Collection. Example: 23-25, 34, 54-56. For continuous page ranges, use the pageStart and pageEnd properties.
term status: stable
domain: Document
range: Literal
sub property of: locator

prefix name
type: DatatypeProperty
comment: The prefix of a name
term status: stable
domain: Agent
range: Literal

section
type: DatatypeProperty
comment: A section number
term status: unstable
domain: Document
range: Literal
sub property of: locator
example: Di Rado, Alicia. 1995. Trekking through college: Classes explore modern society using the world of Star trek. Los Angeles Times, March 15, sec. A, p. 3.

short title
type: DatatypeProperty
comment: The abbreviation of a title.
term status: stable
domain: Document
range: Literal

suffix name
type: DatatypeProperty
comment: The suffix of a name
term status: stable
domain: Agent
range: Literal

uri
type: DatatypeProperty
comment: Universal Resource Identifier of a document
term status: stable
domain: Class
  unionOf: Collection
  unionOf: Document
domain: Class
  unionOf: Collection
  unionOf: Document
range: Literal
sub property of: identifier

localityName
type: DatatypeProperty
scope note: Used to name the locality of a publisher, an author, etc.

Academic Article
type: Class
comment: A scholarly academic article, typically published in a journal.
term status: stable
subclass of: Article

Article
type: Class
comment: A written composition in prose, usually nonfiction, on a specific topic, forming an independent part of a book or other publication, as a newspaper or magazine.
term status: stable
subclass of: Document

audio document
type: Class
comment: An audio document; aka record.
term status: stable
subclass of: Document

Bill
type: Class
comment: Draft legislation presented for discussion to a legal body.
term status: stable
subclass of: Legislation

Legislation
type: Class
comment: A legal document proposing or enacting a law or a group of laws.
term status: unstable
subclass of: Legal Document

Book
type: Class
comment: A written or printed work of fiction or nonfiction, usually on sheets of paper fastened or bound together within covers.
term status: stable
subclass of: Document

document part
type: Class
comment: a distinct part of a larger document or collected document.
term status: unstable
subclass of: Document
subclass of: Restriction
  onProperty: isPartOf
  maxCardinality: 1
subclass of: Restriction
  onProperty: isPartOf
  maxCardinality: 1

Brief
type: Class
comment: A written argument submitted to a court.
term status: unstable
subclass of: Legal Case Document

Legal Case Document
type: Class
comment: A document accompanying a legal case.
term status: unstable
subclass of: Legal Document

Chapter
type: Class
comment: A chapter of a book.
term status: unstable
subclass of: Book Section

Code
type: Class
comment: A collection of statutes.
term status: stable
subclass of: Periodical
subclass of: Restriction
  allValuesFrom: Legislation
  onProperty: hasPart
subclass of: Restriction
  onProperty: hasPart
  minCardinality: 1
subclass of: Restriction
  allValuesFrom: Legislation
  onProperty: hasPart
subclass of: Restriction
  onProperty: hasPart
  minCardinality: 1

Periodical
type: Class
comment: A group of related documents issued at regular intervals.
term status: stable
subclass of: Collection
subclass of: Restriction
  onProperty: hasPart
  minCardinality: 1
subclass of: Restriction
  allValuesFrom: Issue
  onProperty: hasPart
subclass of: Restriction
  onProperty: hasPart
  minCardinality: 1
subclass of: Restriction
  allValuesFrom: Issue
  onProperty: hasPart

Collected Document
type: Class
comment: A document that simultaneously contains other documents.
term status: stable
subclass of: Document
subclass of: Restriction
  onProperty: hasPart
  minCardinality: 1
subclass of: Restriction
  allValuesFrom: Document
  onProperty: hasPart
subclass of: Restriction
  onProperty: hasPart
  minCardinality: 1
subclass of: Restriction
  allValuesFrom: Document
  onProperty: hasPart

Conference
type: Class
comment: A meeting for consultation or discussion.
term status: stable
subclass of: Event

Court Reporter
type: Class
comment: A collection of legal cases.
term status: stable
subclass of: Periodical
subclass of: Restriction
  onProperty: hasPart
  minCardinality: 1
subclass of: Restriction
  allValuesFrom: Legal Document
  onProperty: hasPart
subclass of: Restriction
  onProperty: hasPart
  minCardinality: 1
subclass of: Restriction
  allValuesFrom: Legal Document
  onProperty: hasPart

Edited Book
type: Class
comment: An edited book.
term status: stable
subclass of: Collected Document

EMail
type: Class
comment: A written communication addressed to a person or organization and transmitted electronically.
term status: stable
subclass of: Personal Communication Document

Excerpt
type: Class
comment: A passage selected from a larger work.
term status: stable
subclass of: document part

Film
type: Class
comment: aka movie.
term status: stable
subclass of: audio-visual document

Hearing
type: Class
comment: An instance or a session in which testimony and arguments are presented, esp. before an official, as a judge in a lawsuit.
term status: stable
subclass of: Event

Image
type: Class
comment: A document that presents visual or diagrammatic information.
term status: stable
subclass of: Document
equivalentClass: Image

Interview
type: Class
comment: A formalized discussion between two or more people.
term status: stable
subclass of: Event

Journal
type: Class
comment: A periodical of scholarly journal Articles.
term status: stable
subclass of: Periodical
subclass of: Restriction
  allValuesFrom: Issue
  onProperty: hasPart
subclass of: Restriction
  onProperty: hasPart
  minCardinality: 1
subclass of: Restriction
  allValuesFrom: Issue
  onProperty: hasPart
subclass of: Restriction
  onProperty: hasPart
  minCardinality: 1

Letter
type: Class
comment: A written or printed communication addressed to a person or organization and usually transmitted by mail.
term status: stable
subclass of: Personal Communication Document

Magazine
type: Class
comment: A periodical of magazine Articles. A magazine is a publication that is issued periodically, usually bound in a paper cover, and typically contains essays, stories, poems, etc., by many writers, and often photographs and drawings, frequently specializing in a particular subject or area, as hobbies, news, or sports.
term status: stable
subclass of: Periodical
subclass of: Restriction
  allValuesFrom: Issue
  onProperty: hasPart
subclass of: Restriction
  onProperty: hasPart
  minCardinality: 1
subclass of: Restriction
  allValuesFrom: Issue
  onProperty: hasPart
subclass of: Restriction
  onProperty: hasPart
  minCardinality: 1

Manual
type: Class
comment: A small reference book, especially one giving instructions.
term status: unstable
subclass of: Document

Manuscript
type: Class
comment: An unpublished Document, which may also be submitted to a publisher for publication.
term status: stable
subclass of: Document

Map
type: Class
comment: A graphical depiction of geographic features.
term status: unstable
subclass of: Image

Series
type: Class
comment: A loose, thematic, collection of Documents, often Books.
term status: stable
subclass of: Collection
subclass of: Restriction
  allValuesFrom: Book
  onProperty: hasPart
subclass of: Restriction
  allValuesFrom: Book
  onProperty: hasPart

Newspaper
type: Class
comment: A periodical of documents, usually issued daily or weekly, containing current news, editorials, feature articles, and usually advertising.
term status: stable
subclass of: Periodical
subclass of: Restriction
  allValuesFrom: Issue
  onProperty: hasPart
subclass of: Restriction
  onProperty: hasPart
  minCardinality: 1
subclass of: Restriction
  allValuesFrom: Issue
  onProperty: hasPart
subclass of: Restriction
  onProperty: hasPart
  minCardinality: 1

Patent
type: Class
comment: A document describing the exclusive right granted by a government to an inventor to manufacture, use, or sell an invention for a certain number of years.
term status: stable
subclass of: Document

Personal Communication
type: Class
comment: A communication between an agent and one or more specific recipients.
term status: stable
subclass of: Event

Proceedings
type: Class
comment: A compilation of documents published from an event, such as a conference.
term status: unstable
subclass of: Book

Quote
type: Class
comment: An excerpted collection of words.
term status: stable
subclass of: Excerpt

Reference Source
type: Class
comment: A document that presents authoritative reference information, such as a dictionary or encylopedia .
term status: unstable
subclass of: Document

Report
type: Class
comment: A document describing an account or statement describing in detail an event, situation, or the like, usually as the result of observation, inquiry, etc..
term status: stable
subclass of: Document

Series
type: Class
comment: A loose, thematic, collection of Documents, often Books.
term status: stable
subclass of: Collection
subclass of: Restriction
  allValuesFrom: Document
  onProperty: hasPart
subclass of: Restriction
  allValuesFrom: Document
  onProperty: hasPart

Slide
type: Class
comment: A slide in a slideshow
term status: unstable
subclass of: document part

Slideshow
type: Class
comment: A presentation of a series of slides, usually presented in front of an audience with written text and images.
term status: stable
subclass of: Document
subclass of: Restriction
  allValuesFrom: Slide
  onProperty: hasPart
subclass of: Restriction
  allValuesFrom: Slide
  onProperty: hasPart

Standard
type: Class
comment: A document describing a standard
term status: stable
subclass of: Document

Statute
type: Class
comment: A bill enacted into law.
term status: stable
subclass of: Legislation

Webpage
type: Class
comment: A web page is an online document available (at least initially) on the world wide web. A web page is written first and foremost to appear on the web, as distinct from other online resources such as books, manuscripts or audio documents which use the web primarily as a distribution mechanism alongside other more traditional methods such as print.
term status: unstable
subclass of: Document

Website
type: Class
comment: A group of Webpages accessible on the Web.
term status: unstable
subclass of: Collection
subclass of: Restriction
  allValuesFrom: Webpage
  onProperty: hasPart
subclass of: Restriction
  onProperty: hasPart
  minCardinality: 1
subclass of: Restriction
  allValuesFrom: Webpage
  onProperty: hasPart
subclass of: Restriction
  onProperty: hasPart
  minCardinality: 1

Workshop
type: Class
comment: A seminar, discussion group, or the like, that emphasizes zxchange of ideas and the demonstration and application of techniques, skills, etc.
term status: stable
subclass of: Event

M.A.
type: Thing
type: Thesis degree
comment: masters degree in arts
term status: stable

M.S.
type: Thing
type: Thesis degree
comment: masters degree in science
term status: stable

PhD degree
type: Thing
type: Thesis degree
comment: PhD degree
term status: stable

accepted
type: Thing
type: Document Status
comment: Accepted for publication after peer reviewing.
term status: stable

draft
type: Thing
type: Document Status
comment: Document drafted
term status: stable

forthcoming
type: Thing
type: Document Status
comment: Document to be published
term status: stable

legal
type: Thing
type: Document Status
comment: Legal document
term status: stable

non peer reviewed
type: Thing
type: Document Status
comment: A document that is not peer reviewed
term status: stable

peer reviewed
type: Thing
type: Document Status
comment: The process by which articles are chosen to be included in a refereed journal. An editorial board consisting of experts in the same field as the author review the article and decide if it is authoritative enough for publication.
term status: stable

published
type: Thing
type: Document Status
comment: Published document
term status: stable

rejected
type: Thing
type: Document Status
comment: Rejected for publication after peer reviewing.
term status: stable

unpublished
type: Thing
type: Document Status
comment: Unpublished document
term status: stable

Has Speaker
type: ObjectProperty
domain: Talk Event
range: Person
inverseOf: Speaker At

Speaker At
type: ObjectProperty
domain: Person
range: Talk Event
inverseOf: Has Speaker

Nick Van den Bleeken's 2013 talk
type: Talk Event
has related document: Nick Van den Bleeken's 2013 paper
has related document: Nick Van den Bleeken's 2013 slides
is sub-event of: XML London 2013
Has Speaker: Nick Van den Bleeken

Eric Van der Vlist's 2013 talk
type: Talk Event
has related document: Eric Van der Vlist's 2013 paper
has related document: Eric Van der Vlist's 2013 slides
is sub-event of: XML London 2013
Has Speaker: Eric Van Der Vlist

O'Neil Delpratt's 2013 talk
type: Talk Event
has related document: O'Neil Delpratt's 2013 paper
has related document: O'Neil Delpratt's 2013 slides
is sub-event of: XML London 2013
Has Speaker: O'Neil Delpratt

Tomos Hillman's 2013 talk
type: Talk Event
has related document: Tomos Hillman's 2013 paper
has related document: Tomos Hillman's 2013 slides
is sub-event of: XML London 2013
Has Speaker: Tomos Hillman

Nigel Whitaker's 2013 talk
type: Talk Event
has related document: Nigel Whitaker's 2013 paper
has related document: Nigel Whitaker's 2013 slides
is sub-event of: XML London 2013
Has Speaker: Nigel Whitaker

Autumn Cuellar's 2013 talk
type: Talk Event
has related document: Autumn Cuellar's 2013 paper
has related document: Autumn Cuellar's 2013 slides
is sub-event of: XML London 2013
Has Speaker: Autumn Cuellar

Stéphane Sire's 2013 talk
type: Talk Event
has related document: Stéphane Sire's 2013 paper
has related document: Stéphane Sire's 2013 slides
is sub-event of: XML London 2013
Has Speaker: Stéphane Sire

Philip Fennell's 2013 talk
type: Talk Event
has related document: Philip Fennell's 2013 paper
has related document: Philip Fennell's 2013 slides
is sub-event of: XML London 2013
Has Speaker: Philip Fennell

Rob Walpole's 2013 talk
type: Talk Event
has related document: Rob Walpole's 2013 paper
has related document: Rob Walpole's 2013 slides
is sub-event of: XML London 2013
Has Speaker: Rob Walpole

Catherine Dolbear's 2013 talk
type: Talk Event
has related document: Catherine Dolbear's 2013 paper
has related document: Catherine Dolbear's 2013 slides
is sub-event of: XML London 2013
Has Speaker: Catherine Dolbear

James Fuller's 2013 talk
type: Talk Event
has related document: James Fuller's 2013 paper
has related document: James Fuller's 2013 slides
is sub-event of: XML London 2013
Has Speaker: James Fuller

Abel Braaksma's 2013 talk
type: Talk Event
has related document: Abel Braaksma's 2013 paper
is sub-event of: XML London 2013
Has Speaker: Abel Braaksma

Adrian Warman's 2013 talk
type: Talk Event
has related document: Adrian Warman's 2013 paper
has related document: Adrian Warman's 2013 slides
is sub-event of: XML London 2013
Has Speaker: Adrian Warman

Sebastian Rahtz's 2013 talk
type: Talk Event
has related document: Sebastian Rahtz's 2013 paper
has related document: Sebastian Rahtz's 2013 slides
is sub-event of: XML London 2013
Has Speaker: Sebastian Rahtz

Michael Kay's 2014 talk
type: Talk Event
has related document: Michael Kay's 2014 paper
is sub-event of: XML London 2014
Has Speaker: Michael Kay

Abel Braaksma's 2014 talk
type: Talk Event
has related document: Abel Braaksma's 2014 paper
is sub-event of: XML London 2014
Has Speaker: Abel Braaksma

Matt Kohl's 2014 talk
type: Talk Event
has related document: Matt Kohl's 2014 paper
has related document: Matt Kohl's 2014 slides
is sub-event of: XML London 2014
Has Speaker: Matt Kohl

William Narmontas's 2014 talk
type: Talk Event
has related document: William Narmontas's 2014 paper
has related document: William Narmontas's 2014 slides
is sub-event of: XML London 2014
Has Speaker: William Narmontas

George Bina's 2014 talk
type: Talk Event
has related document: George Bina's 2014 paper
has related document: George Bina's 2014 slides
is sub-event of: XML London 2014
Has Speaker: George Bina

Elias Weingärtner's 2014 talk
type: Talk Event
has related document: Elias Weingärtner's 2014 paper
has related document: Elias Weingärtner's 2014 slides
is sub-event of: XML London 2014
Has Speaker: Elias Weingärtner

Celina Huang's 2014 talk
type: Talk Event
has related document: Celina Huang's 2014 paper
has related document: Celina Huang's 2014 slides
is sub-event of: XML London 2014
Has Speaker: Celina Huang

Steven Pemberton's 2014 talk
type: Talk Event
has related document: Steven Pemberton's 2014 paper
has related document: Steven Pemberton's 2014 slides
is sub-event of: XML London 2014
Has Speaker: Steven Pemberton

Philip Fennell's 2014 talk
type: Talk Event
has related document: Philip Fennell's 2014 paper
has related document: Philip Fennell's 2014 slides
is sub-event of: XML London 2014
Has Speaker: Philip Fennell

Kal Ahmed's 2014 talk
type: Talk Event
has related document: Kal Ahmed's 2014 paper
has related document: Kal Ahmed's 2014 slides
is sub-event of: XML London 2014
Has Speaker: Kal Ahmed

Robbert Broersma's 2014 talk
type: Talk Event
has related document: Robbert Broersma's 2014 paper
is sub-event of: XML London 2014
Has Speaker: Robbert Broersma

Jorge Williams's 2014 talk
type: Talk Event
has related document: Jorge Williams's 2014 paper
has related document: Jorge Williams's 2014 slides
is sub-event of: XML London 2014
Has Speaker: Jorge Williams

Jorge Williams's 2014 slides
type: Slide Set
related to Event: Jorge Williams's 2014 talk

Eduardo Gonçalves's 2014 talk
type: Talk Event
has related document: Eduardo Gonçalves's 2014 paper
has related document: Eduardo Gonçalves's 2014 slides
is sub-event of: XML London 2014
Has Speaker: Eduardo Corrêa Gonçalves

Lech Rzedzicki's 2014 talk
type: Talk Event
has related document: Lech Rzedzicki's 2014 paper
is sub-event of: XML London 2014
Has Speaker: Lech Rzedzicki

Eric van der Vlist's 2014 talk
type: Talk Event
has related document: Eric van der Vlist's 2014 paper
has related document: Eric van der Vlist's 2014 slides
is sub-event of: XML London 2014
Has Speaker: Eric Van Der Vlist

Nick Van den Bleeken's 2013 slides
type: Slide Set
related to Event: Nick Van den Bleeken's 2013 talk

Eric Van der Vlist's 2013 slides
type: Slide Set
related to Event: Eric Van der Vlist's 2013 talk

O'Neil Delpratt's 2013 slides
type: Slide Set
related to Event: O'Neil Delpratt's 2013 talk

Tomos Hillman's 2013 slides
type: Slide Set
related to Event: Tomos Hillman's 2013 talk

Nigel Whitaker's 2013 slides
type: Slide Set
related to Event: Nigel Whitaker's 2013 talk

Autumn Cuellar's 2013 slides
type: Slide Set
related to Event: Autumn Cuellar's 2013 talk

Stéphane Sire's 2013 slides
type: Slide Set
related to Event: Stéphane Sire's 2013 talk

Philip Fennell's 2013 slides
type: Slide Set
related to Event: Philip Fennell's 2013 talk

Rob Walpole's 2013 slides
type: Slide Set
related to Event: Rob Walpole's 2013 talk

Catherine Dolbear's 2013 slides
type: Slide Set
related to Event: Catherine Dolbear's 2013 talk

James Fuller's 2013 slides
type: Slide Set
related to Event: James Fuller's 2013 talk

Adrian Warman's 2013 slides
type: Slide Set
related to Event: Adrian Warman's 2013 talk

Sebastian Rahtz's 2013 slides
type: Slide Set
related to Event: Sebastian Rahtz's 2013 talk

Matt Kohl's 2014 slides
type: Slide Set
related to Event: Matt Kohl's 2014 talk

William Narmontas's 2014 slides
type: Slide Set
related to Event: William Narmontas's 2014 talk

George Bina's 2014 slides
type: Slide Set
related to Event: George Bina's 2014 talk

Elias Weingärtner's 2014 slides
type: Slide Set
related to Event: Elias Weingärtner's 2014 talk

Celina Huang's 2014 slides
type: Slide Set
related to Event: Celina Huang's 2014 talk

Steven Pemberton's 2014 slides
type: Slide Set
related to Event: Steven Pemberton's 2014 talk

Philip Fennell's 2014 slides
type: Slide Set
related to Event: Philip Fennell's 2014 talk

Kal Ahmed's 2014 slides
type: Slide Set
related to Event: Kal Ahmed's 2014 talk

Eduardo Gonçalves's 2014 slides
type: Slide Set
related to Event: Eduardo Gonçalves's 2014 talk

Eric van der Vlist's 2014 slides
type: Slide Set
related to Event: Eric van der Vlist's 2014 talk

Geert Bormans
type: Person
holds role: 2015 Programme Committee Member
holds role: 2016 Programme Committee Member
family_name: Bormans
firstName: Geert
Online Account: gbormans
Online Account: geertidb

Andrew Sales
type: Person
holds role: 2015 Presenter
holds role: 2016 Presenter
family_name: Sales
firstName: Andrew
Online Account: http://uk.linkedin.com/pub/andrew-sales/1/40/187
Speaker At: Andrew Sales's 2015 talk
Speaker At: Andrew Sales's 2016 talk

Andy Seaborne
type: Person
holds role: 2015 Presenter
family_name: Seaborne
firstName: Andy
member of: Epimorphics
Online Account: andyseaborne
Online Account: afs
Speaker At: Andy Seaborne's 2015 talk

Chris de Vreeze
type: Person
holds role: 2015 Presenter
family_name: de Vreeze
firstName: Chris
Online Account: http://www.linkedin.com/pub/chris-de-vreeze/2/329/647
Online Account: dvreeze
Speaker At: Chris de Vreeze's 2015 talk

Fabio Labella
type: Person
holds role: 2015 Presenter
family_name: Labella
firstName: Fabio
member of: University of Edinburgh
Online Account: en
Speaker At: Fabio Labella's 2015 talk

John Lumley
type: Person
holds role: 2015 Presenter
family_name: Lumley
firstName: John
member of: Saxonica
Online Account: johnlumley
Speaker At: John Lumley's 2015 talk

Nic Gibson
type: Person
holds role: 2015 Presenter
family_name: Gibson
firstName: Nic
Online Account: nicgibson
Online Account: nic gibson
Online Account: nicg-corbas
Speaker At: Nic Gibson's 2015 talk

Philip Fearon
type: Person
holds role: 2015 Presenter
family_name: Fearon
firstName: Philip
member of: DeltaXML
Online Account: philipfearon
Online Account: pgfearo
Speaker At: Philip Fearon's 2015 talk

Shinyu Murakami
type: Person
holds role: 2015 Presenter
family_name: Murakami
firstName: Shinyu
name: 村上 真雄 @ja
member of: Vivliostyle
Online Account: 7b5
Online Account: murakamishinyu
Online Account: MurakamiShinyu
Speaker At: Shinyu Murakami's 2015 talk

2015 Conference Proceedings
type: Proceedings
has part: John Lumley's 2015 paper
has part: Abel Braaksma's 2015 paper
has part: Sandro Cirulli's 2015 paper
has part: Shinyu Murakami's 2015 paper
has part: George Bina's 2015 paper
has part: Fabio Labella's 2015 paper
has part: Andy Seaborne's 2015 paper
has part: Steven Pemberton's 2015 paper
has part: Philip Fearon's 2015 paper
has part: Adam Retter's 2015 paper
has part: Nic Gibson's 2015 paper
has part: Tony Graham's 2015 paper
has part: Chris de Vreeze's 2015 paper
has part: Eric van der Vlist's 2015 paper
has part: James Fuller's 2015 paper
has part: Andrew Sales's 2015 paper
has part: Johannes Wilm's 2015 paper
related to Event: XML London 2015

John Lumley's 2015 paper
type: Paper
type: InProceedings
is part of: 2015 Conference Proceedings
creator: Michael Kay
creator: John Lumley
title: Improving Pattern Matching Performance in XSLT
page start: 9
page end: 25
month: June
year: 2015
related to Event: John Lumley's 2015 talk

Abel Braaksma's 2015 paper
type: Paper
type: InProceedings
is part of: 2015 Conference Proceedings
creator: Abel Braaksma
title: It's the little things that matter
page start: 26
page end: 51
month: June
year: 2015
related to Event: Abel Braaksma's 2015 talk

Sandro Cirulli's 2015 paper
type: Paper
type: InProceedings
is part of: 2015 Conference Proceedings
creator: Sandro Cirulli
title: Continuous Integration with XML and RDF Data
title: Continuous Integration for XML and RDF Data
page start: 52
page end: 60
month: June
year: 2015
related to Event: Sandro Cirulli's 2015 talk

Shinyu Murakami's 2015 paper
type: Paper
type: InProceedings
is part of: 2015 Conference Proceedings
creator: Shinyu Murakami
creator: Johannes Wilm
title: Vivliostyle - Open source, web browser based CSS typesetting engine
month: June
year: 2015
related to Event: Shinyu Murakami's 2015 talk

George Bina's 2015 paper
type: Paper
type: InProceedings
is part of: 2015 Conference Proceedings
creator: George Bina
title: Magic URLs in an XML Universe
page start: 63
page end: 68
month: June
year: 2015
related to Event: George Bina's 2015 talk

Fabio Labella's 2015 paper
type: Paper
type: InProceedings
is part of: 2015 Conference Proceedings
creator: Fabio Labella
creator: Henry S. Thompson
title: A Rendering Language for RDF
title: A rendering language for RDF
page start: 69
page end: 80
month: June
year: 2015
related to Event: Fabio Labella's 2015 talk

Andy Seaborne's 2015 paper
type: Paper
type: InProceedings
is part of: 2015 Conference Proceedings
creator: Andy Seaborne
title: Lizard - A Fault Tolerant SPARQL Store
title: Lizard
page start: 109
page end: 113
month: June
year: 2015
related to Event: Andy Seaborne's 2015 talk

Steven Pemberton's 2015 paper
type: Paper
type: InProceedings
is part of: 2015 Conference Proceedings
creator: Steven Pemberton
title: XML Interfaces to the Internet of Things with XForms
page start: 163
page end: 168
month: June
year: 2015
related to Event: Steven Pemberton's 2015 talk

Philip Fearon's 2015 paper
type: Paper
type: InProceedings
label: Phil Fearon's 2015 paper
is part of: 2015 Conference Proceedings
creator: Philip Fearon
creator: phil-fearon
title: Streamlining XML Authoring Workflows
page start: 114
page end: 124
month: June
year: 2015
related to Event: Philip Fearon's 2015 talk

Adam Retter's 2015 paper
type: Paper
type: InProceedings
is part of: 2015 Conference Proceedings
creator: Adam Retter
title: Implementation of Portable EXPath Extension Functions
page start: 125
page end: 142
month: June
year: 2015
related to Event: Adam Retter's 2015 talk

Nic Gibson's 2015 paper
type: Paper
type: InProceedings
is part of: 2015 Conference Proceedings
creator: Nic Gibson
title: Publishing with XProc
page start: 81
page end: 89
month: June
year: 2015
related to Event: Nic Gibson's 2015 talk

Tony Graham's 2015 paper
type: Paper
type: InProceedings
is part of: 2015 Conference Proceedings
creator: Tony Graham
title: Validating XSL-FO with Relax NG and Schematron
page start: 143
page end: 152
month: June
year: 2015
related to Event: Tony Graham's 2015 talk

Chris de Vreeze's 2015 paper
type: Paper
type: InProceedings
is part of: 2015 Conference Proceedings
creator: Chris de Vreeze
title: XML Processing with Scala and yaidom
page start: 99
page end: 108
month: June
year: 2015
related to Event: Chris de Vreeze's 2015 talk

Eric van der Vlist's 2015 paper
type: Paper
type: InProceedings
is part of: 2015 Conference Proceedings
creator: Eric Van Der Vlist
title: Data Driven Programming in XQuery
title: Data-Driven Programming in XQuery
page start: 90
page end: 98
month: June
year: 2015
related to Event: Eric van der Vlist's 2015 talk

James Fuller's 2015 paper
type: Paper
type: InProceedings
is part of: 2015 Conference Proceedings
creator: James Fuller
title: Diaries of a Desperate XProc Hacker
title: Diaries of a desperate XProc Hacker
page start: 169
page end: 176
month: June
year: 2015
related to Event: James Fuller's 2015 talk

Andrew Sales's 2015 paper
type: Paper
type: InProceedings
is part of: 2015 Conference Proceedings
creator: Andrew Sales
title: The application of Schematron schemas to word-processing documents
page start: 153
page end: 162
month: June
year: 2015
related to Event: Andrew Sales's 2015 talk

John Lumley's 2015 talk
type: Talk Event
has related document: John Lumley's 2015 paper
has related document: John Lumley's 2015 slides
is sub-event of: XML London 2015
Has Speaker: John Lumley

Abel Braaksma's 2015 talk
type: Talk Event
has related document: Abel Braaksma's 2015 paper
is sub-event of: XML London 2015
Has Speaker: Abel Braaksma

Sandro Cirulli's 2015 talk
type: Talk Event
has related document: Sandro Cirulli's 2015 paper
has related document: Sandro Cirulli's 2015 slides
is sub-event of: XML London 2015
Has Speaker: Sandro Cirulli

Johannes Wilm
type: Person
holds role: 2015 Presenter
family_name: Wilm
firstName: Johannes
member of: Vivliostyle
Online Account: johanneswilm
Speaker At: Johannes Wilm's 2015 talk

Shinyu Murakami's 2015 talk
type: Talk Event
has related document: Shinyu Murakami's 2015 paper
is sub-event of: XML London 2015
Has Speaker: Shinyu Murakami

George Bina's 2015 talk
type: Talk Event
has related document: George Bina's 2015 paper
has related document: George Bina's 2015 slides
is sub-event of: XML London 2015
Has Speaker: George Bina

Henry S. Thompson
type: Person
family_name: Thompson
firstName: Henry
member of: University of Edinburgh
Online Account: http://uk.linkedin.com/pub/henry-thompson/0/232/446

Fabio Labella's 2015 talk
type: Talk Event
has related document: Fabio Labella's 2015 paper
has related document: Fabio Labella's 2015 slides
is sub-event of: XML London 2015
Has Speaker: Fabio Labella

Andy Seaborne's 2015 talk
type: Talk Event
has related document: Andy Seaborne's 2015 paper
has related document: Andy Seaborne's 2015 slides
is sub-event of: XML London 2015
Has Speaker: Andy Seaborne

Steven Pemberton's 2015 talk
type: Talk Event
has related document: Steven Pemberton's 2015 paper
has related document: Steven Pemberton's 2015 slides
is sub-event of: XML London 2015
Has Speaker: Steven Pemberton

Philip Fearon's 2015 talk
type: Talk Event
label: Phil Fearon's 2015 talk
has related document: Philip Fearon's 2015 paper
has related document: Phil Fearon's 2015 slides
is sub-event of: XML London 2015
Has Speaker: Philip Fearon
Has Speaker: phil-fearon

Adam Retter's 2015 talk
type: Talk Event
has related document: Adam Retter's 2015 paper
has related document: Adam Retter's 2015 slides
is sub-event of: XML London 2015
Has Speaker: Adam Retter

Nic Gibson's 2015 talk
type: Talk Event
has related document: Nic Gibson's 2015 paper
has related document: Nic Gibson's 2015 slides
is sub-event of: XML London 2015
Has Speaker: Nic Gibson

Tony Graham
type: Person
holds role: 2015 Presenter
family_name: Graham
firstName: Tony
member of: Antenna House
member of: XML Guild
Online Account: tonygraham
Online Account: tgraham antenna
Online Account: tgraham-antenna
Speaker At: Tony Graham's 2015 talk

Tony Graham's 2015 talk
type: Talk Event
has related document: Tony Graham's 2015 paper
has related document: Tony Graham's 2015 slides
is sub-event of: XML London 2015
Has Speaker: Tony Graham

Chris de Vreeze's 2015 talk
type: Talk Event
has related document: Chris de Vreeze's 2015 paper
has related document: Chris de Vreeze's 2015 slides
is sub-event of: XML London 2015
Has Speaker: Chris de Vreeze

Eric van der Vlist's 2015 talk
type: Talk Event
has related document: Eric van der Vlist's 2015 paper
has related document: Eric van der Vlist's 2015 slides
is sub-event of: XML London 2015
Has Speaker: Eric Van Der Vlist

James Fuller's 2015 talk
type: Talk Event
has related document: James Fuller's 2015 paper
has related document: James Fuller's 2015 slides
is sub-event of: XML London 2015
Has Speaker: James Fuller

Andrew Sales's 2015 talk
type: Talk Event
has related document: Andrew Sales's 2015 paper
has related document: Andrew Sales's 2015 slides
is sub-event of: XML London 2015
Has Speaker: Andrew Sales

Vivliostyle
type: Organization
name: Vivliostyle Inc.
member: Shinyu Murakami
member: Johannes Wilm
Online Account: vivliostyle

University of Edinburgh
type: Organization
member: Fabio Labella
member: Henry S. Thompson
Online Account: EdinburghUni

Epimorphics
type: Organization
name: Epimorphics Ltd
member: Andy Seaborne
Online Account: epimorphics

Balisage 2015
type: Conference Event
Online Account: about
Online Account: balisage
Sister Event: XML London 2015
Sister Event: XML Prague 2015
Sister Event: XML Summer School 2015
Related Event: Balisage 2014
Related Event: Balisage 2013
Related Event: Balisage 2016

Johannes Wilm's 2015 paper
type: Paper
type: InProceedings
is part of: 2015 Conference Proceedings
creator: Shinyu Murakami
creator: Johannes Wilm
title: Vivliostyle - Web browser based CSS typesetting engine
page start: 61
page end: 62
month: June
year: 2015
related to Event: Johannes Wilm's 2015 talk

Johannes Wilm's 2015 talk
type: Talk Event
has related document: Johannes Wilm's 2015 paper
has related document: Johannes Wilm's 2015 slides
is sub-event of: XML London 2015
Has Speaker: Johannes Wilm

Balisage 2014
type: Conference Event
Online Account: about
Online Account: balisage
Sister Event: XML Prague 2014
Related Event: Balisage 2015
Related Event: Balisage 2013
Related Event: Balisage 2016

Balisage 2013
type: Conference Event
Online Account: about
Online Account: balisage
Sister Event: XML Prague 2013
Related Event: Balisage 2015
Related Event: Balisage 2014
Related Event: Balisage 2016

XML London 2016
type: Conference Event
has related document: 2016 Conference Proceedings
has role: 2016 Chair
has role: 2016 Programme Committee Member
has role: 2016 Presenter
has location: Roberts Engineering Building (UCL)
Online Account: about
Online Account: xmllondon
Sister Event: XML Prague 2016
Sister Event: XML Summer School 2016
Sister Event: Balisage 2016
Related Event: XML London 2014
Related Event: XML London 2013
Related Event: XML London 2015

2016 Conference Proceedings
type: Proceedings
has part: Abel Braaksma's 2016 paper
has part: Lech Rzedzicki's 2016 paper
has part: Dianne Kennedy's 2016 paper
has part: Nigel Whitaker's 2016 paper
has part: Malte Brunnlieb's 2016 paper
has part: Martynas Jusevičius's 2016 paper
has part: John Chelsom's 2016 paper
has part: Soroush Saadatfar's 2016 paper
has part: Andrew Sales's 2016 paper
has part: John Sheridan's 2016 paper
has part: Achim Berndzen's 2016 paper
has part: Ethan Gruber's 2016 paper
has part: Simon Dew's 2016 paper
has part: Steven Pemberton's 2016 paper
related to Event: XML London 2016

2016 Chair
type: Chair
held by: Charles Foster
is role at: XML London 2016

2016 Programme Committee Member
type: Programme Committee Member
held by: Charles Foster
held by: Eric Van Der Vlist
held by: Philip Fennell
held by: James Fuller
held by: Abel Braaksma
held by: Adam Retter
held by: Mohamed Zergaoui
held by: Christian Grün
held by: John Snelson
held by: Norman Walsh
held by: Geert Bormans
is role at: XML London 2016

2016 Presenter
type: Presenter
held by: Michael Kay
held by: Nigel Whitaker
held by: Abel Braaksma
held by: Steven Pemberton
held by: Lech Rzedzicki
held by: Andrew Sales
held by: Dianne Kennedy
held by: Malte Brunnlieb
held by: Martynas Jusevičius
held by: John Chelsom
held by: Soroush Saadatfar
held by: John Sheridan
held by: Achim Berndzen
held by: Ethan Gruber
held by: Simon Dew
is role at: XML London 2016

XML Prague 2016
type: Conference Event
Online Account: about
Online Account: xmlprague
Sister Event: XML London 2016
Sister Event: XML Summer School 2016
Sister Event: Balisage 2016
Related Event: XML Prague 2015
Related Event: XML Prague 2014
Related Event: XML Prague 2013

XML Summer School 2016
type: Academic Event
Online Account: about
Online Account: xmlsummerschool
Sister Event: XML London 2016
Sister Event: XML Prague 2016
Sister Event: Balisage 2016
Related Event: XML Summer School 2015
Related Event: XML Summer School 2014
Related Event: XML Summer School 2013

Balisage 2016
type: Conference Event
Online Account: about
Online Account: balisage
Sister Event: XML London 2016
Sister Event: XML Prague 2016
Sister Event: XML Summer School 2016
Related Event: Balisage 2015
Related Event: Balisage 2014
Related Event: Balisage 2013

Dianne Kennedy
type: Person
holds role: 2016 Presenter
family_name: Kennedy
firstName: Diane
name: Diane Kennedy
member of: Idealliance, Inc.
Online Account: diannekennedy1
Online Account: diannekennedy
Speaker At: Dianne Kennedy's 2016 talk

Malte Brunnlieb
type: Person
holds role: 2016 Presenter
family_name: Brunnlieb
firstName: Malte
member of: Capgemini
Online Account: malte-brunnlieb-49307bb8
Online Account: may-bee
Speaker At: Malte Brunnlieb's 2016 talk

Martynas Jusevičius
type: Person
holds role: 2016 Presenter
family_name: Jusevičius
firstName: Martynas
member of: Graphity
Online Account: martynasjusevicius
Online Account: pumba-lt
Online Account: pumba lt
Speaker At: Martynas Jusevičius's 2016 talk

John Chelsom
type: Person
holds role: 2016 Presenter
family_name: Chelsom
firstName: John
member of: City University, London
Online Account: johnchelsom
Speaker At: John Chelsom's 2016 talk

Soroush Saadatfar
type: Person
holds role: 2016 Presenter
family_name: Saadatfar
firstName: Soroush
member of: ADAPT Centre
Online Account: soroushsdf
Speaker At: Soroush Saadatfar's 2016 talk

John Sheridan
type: Person
holds role: 2016 Presenter
family_name: Sheridan
firstName: John
member of: The National Archives
Online Account: johnlsheridan
Speaker At: John Sheridan's 2016 talk

Achim Berndzen
type: Person
holds role: 2016 Presenter
family_name: Berndzen
firstName: Achim
member of: <xml-project/>
Online Account: xml project
Online Account: xml-project
Speaker At: Achim Berndzen's 2016 talk

Ethan Gruber
type: Person
holds role: 2016 Presenter
family_name: Gruber
firstName: Ethan
member of: American Numismatic Society
Online Account: gerrit-imsieke-19b79a28
Online Account: ewg118
Speaker At: Ethan Gruber's 2016 talk

Simon Dew
type: Person
holds role: 2016 Presenter
family_name: Dew
firstName: Simon
member of: Stanley Black & Decker
Online Account: janiveer
Online Account: simonjabadaw
Speaker At: Simon Dew's 2016 talk

Abel Braaksma's 2016 paper
type: Paper
type: InProceedings
is part of: 2016 Conference Proceedings
creator: Abel Braaksma
month: June
year: 2016
related to Event: Abel Braaksma's 2016 talk

Lech Rzedzicki's 2016 paper
type: Paper
type: InProceedings
is part of: 2016 Conference Proceedings
creator: Lech Rzedzicki
month: June
year: 2016
related to Event: Lech Rzedzicki's 2016 talk

Dianne Kennedy's 2016 paper
type: Paper
type: InProceedings
is part of: 2016 Conference Proceedings
creator: Dianne Kennedy
month: June
year: 2016
related to Event: Dianne Kennedy's 2016 talk

Nigel Whitaker's 2016 paper
type: Paper
type: InProceedings
is part of: 2016 Conference Proceedings
creator: Nigel Whitaker
month: June
year: 2016
related to Event: Nigel Whitaker's 2016 talk

Malte Brunnlieb's 2016 paper
type: Paper
type: InProceedings
is part of: 2016 Conference Proceedings
creator: Malte Brunnlieb
creator: Steffen Holzer
month: June
year: 2016
related to Event: Malte Brunnlieb's 2016 talk

Martynas Jusevičius's 2016 paper
type: Paper
type: InProceedings
is part of: 2016 Conference Proceedings
creator: Martynas Jusevičius
month: June
year: 2016
related to Event: Martynas Jusevičius's 2016 talk

John Chelsom's 2016 paper
type: Paper
type: InProceedings
is part of: 2016 Conference Proceedings
creator: John Chelsom
month: June
year: 2016
related to Event: John Chelsom's 2016 talk

Soroush Saadatfar's 2016 paper
type: Paper
type: InProceedings
is part of: 2016 Conference Proceedings
creator: Soroush Saadatfar
creator: David Filip
month: June
year: 2016
related to Event: Soroush Saadatfar's 2016 talk

Andrew Sales's 2016 paper
type: Paper
type: InProceedings
is part of: 2016 Conference Proceedings
creator: Andrew Sales
month: June
year: 2016
related to Event: Andrew Sales's 2016 talk

John Sheridan's 2016 paper
type: Paper
type: InProceedings
is part of: 2016 Conference Proceedings
creator: John Sheridan
creator: Jim Mangiafico
month: June
year: 2016
related to Event: John Sheridan's 2016 talk

Achim Berndzen's 2016 paper
type: Paper
type: InProceedings
is part of: 2016 Conference Proceedings
creator: Achim Berndzen
creator: Gerrit Imsieke
month: June
year: 2016
related to Event: Achim Berndzen's 2016 talk

Ethan Gruber's 2016 paper
type: Paper
type: InProceedings
is part of: 2016 Conference Proceedings
creator: Ethan Gruber
month: June
year: 2016
related to Event: Ethan Gruber's 2016 talk

Simon Dew's 2016 paper
type: Paper
type: InProceedings
is part of: 2016 Conference Proceedings
creator: Simon Dew
month: June
year: 2016
related to Event: Simon Dew's 2016 talk

Steven Pemberton's 2016 paper
type: Paper
type: InProceedings
is part of: 2016 Conference Proceedings
creator: Steven Pemberton
month: June
year: 2016
related to Event: Steven Pemberton's 2016 talk

John Lumley's 2015 slides
type: Slide Set
related to Event: John Lumley's 2015 talk

Sandro Cirulli's 2015 slides
type: Slide Set
related to Event: Sandro Cirulli's 2015 talk

Johannes Wilm's 2015 slides
type: Slide Set
related to Event: Johannes Wilm's 2015 talk

George Bina's 2015 slides
type: Slide Set
related to Event: George Bina's 2015 talk

Fabio Labella's 2015 slides
type: Slide Set
related to Event: Fabio Labella's 2015 talk

Nic Gibson's 2015 slides
type: Slide Set
related to Event: Nic Gibson's 2015 talk

Eric van der Vlist's 2015 slides
type: Slide Set
related to Event: Eric van der Vlist's 2015 talk

Chris de Vreeze's 2015 slides
type: Slide Set
related to Event: Chris de Vreeze's 2015 talk

Andy Seaborne's 2015 slides
type: Slide Set
related to Event: Andy Seaborne's 2015 talk

Phil Fearon's 2015 slides
type: Slide Set
related to Event: Philip Fearon's 2015 talk

Adam Retter's 2015 slides
type: Slide Set
related to Event: Adam Retter's 2015 talk

Tony Graham's 2015 slides
type: Slide Set
related to Event: Tony Graham's 2015 talk

Andrew Sales's 2015 slides
type: Slide Set
related to Event: Andrew Sales's 2015 talk

Steven Pemberton's 2015 slides
type: Slide Set
related to Event: Steven Pemberton's 2015 talk

James Fuller's 2015 slides
type: Slide Set
related to Event: James Fuller's 2015 talk

Abel Braaksma's 2016 talk
type: Talk Event
has related document: Abel Braaksma's 2016 paper
is sub-event of: XML London 2016
Has Speaker: Abel Braaksma

Lech Rzedzicki's 2016 talk
type: Talk Event
has related document: Lech Rzedzicki's 2016 paper
is sub-event of: XML London 2016
Has Speaker: Lech Rzedzicki

Dianne Kennedy's 2016 talk
type: Talk Event
has related document: Dianne Kennedy's 2016 paper
is sub-event of: XML London 2016
Has Speaker: Dianne Kennedy

Nigel Whitaker's 2016 talk
type: Talk Event
has related document: Nigel Whitaker's 2016 paper
is sub-event of: XML London 2016
Has Speaker: Nigel Whitaker

Steffen Holzer
type: Person
family_name: Holzer
firstName: Steffen
member of: Capgemini

Malte Brunnlieb's 2016 talk
type: Talk Event
has related document: Malte Brunnlieb's 2016 paper
is sub-event of: XML London 2016
Has Speaker: Malte Brunnlieb

Martynas Jusevičius's 2016 talk
type: Talk Event
has related document: Martynas Jusevičius's 2016 paper
is sub-event of: XML London 2016
Has Speaker: Martynas Jusevičius

John Chelsom's 2016 talk
type: Talk Event
has related document: John Chelsom's 2016 paper
is sub-event of: XML London 2016
Has Speaker: John Chelsom

David Filip
type: Person
holds role: 2016 Presenter
family_name: Filip
firstName: David
member of: ADAPT Centre
member of: Oasis
Online Account: davidfatdavidf
Online Account: merzbauer

Soroush Saadatfar's 2016 talk
type: Talk Event
has related document: Soroush Saadatfar's 2016 paper
is sub-event of: XML London 2016
Has Speaker: Soroush Saadatfar

Andrew Sales's 2016 talk
type: Talk Event
has related document: Andrew Sales's 2016 paper
is sub-event of: XML London 2016
Has Speaker: Andrew Sales

Jim Mangiafico
type: Person
family_name: Mangiafico
firstName: Jim
Online Account: jmangiafico
Online Account: mangiafico

John Sheridan's 2016 talk
type: Talk Event
has related document: John Sheridan's 2016 paper
is sub-event of: XML London 2016
Has Speaker: John Sheridan

Gerrit Imsieke
type: Person
family_name: Imsieke
firstName: Gerrit
member of: le-tex
Online Account: gerrit-imsieke-19b79a28
Online Account: gimsieke

Achim Berndzen's 2016 talk
type: Talk Event
has related document: Achim Berndzen's 2016 paper
is sub-event of: XML London 2016
Has Speaker: Achim Berndzen

Ethan Gruber's 2016 talk
type: Talk Event
has related document: Ethan Gruber's 2016 paper
is sub-event of: XML London 2016
Has Speaker: Ethan Gruber

Simon Dew's 2016 talk
type: Talk Event
has related document: Simon Dew's 2016 paper
is sub-event of: XML London 2016
Has Speaker: Simon Dew

Steven Pemberton's 2016 talk
type: Talk Event
has related document: Steven Pemberton's 2016 paper
is sub-event of: XML London 2016
Has Speaker: Steven Pemberton

Idealliance, Inc.
type: Organization
member: Dianne Kennedy
Online Account: idealliance

Capgemini
type: Organization
member: Malte Brunnlieb
member: Steffen Holzer
homepage: https://en.wikipedia.org/wiki/Capgemini
Online Account: capgemini

Graphity
type: Organization
member: Martynas Jusevičius
Online Account: graphityhq
Online Account: graphity

City University, London
type: Organization
member: John Chelsom
homepage: http://en.wikipedia.org/wiki/City_University_London
Online Account: cityunilondon
Online Account: cityuniversitylondon

ADAPT Centre
type: Organization
member: Soroush Saadatfar
member: David Filip
Online Account: adaptcentre

Oasis
type: Organization
member: David Filip
homepage: http://en.wikipedia.org/wiki/OASIS_(organization)
Online Account: OASISopen
Online Account: oasis-open

The National Archives
type: Organization
member: John Sheridan
homepage: http://en.wikipedia.org/wiki/The_National_Archives_(United_Kingdom)
Online Account: uknatarchives
Online Account: nationalarchives

<xml-project/>
type: Organization
member: Achim Berndzen
Online Account: xml project

le-tex
type: Organization
member: Gerrit Imsieke
Online Account: letexml
Online Account: le-tex

American Numismatic Society
type: Organization
member: Ethan Gruber
homepage: http://en.wikipedia.org/wiki/American_Numismatic_Society
Online Account: ANSCoins
Online Account: AmericanNumismaticSociety

Stanley Black & Decker
type: Organization
member: Simon Dew
homepage: http://en.wikipedia.org/wiki/Stanley_Black_%26_Decker
Online Account: ANSCoins
Online Account: AmericanNumismaticSociety

XML Amsterdam 2015
type: Organised Event
Sister Event: XML London 2015
Sister Event: XML Prague 2015
Sister Event: XML Prague 2016
Related Event: XML Amsterdam 2013